{"text_format":"1","workbook":"xlsx","n_sheets":5,"sheets":["Introduction","Breed Table","Setting EPD Parameters","Compare Mulitple Sires","Multiple Sire Hidden"],"not_rendered":{"charts":0,"images":2,"macros":1,"external_links":0,"defined_names":1,"comments":1,"pivot_tables":0},"unopened":[],"bounds":{"document_bytes":16777216,"sheet_cells":100000,"rows_first":2000,"rows_last":500,"rows_between":2000,"halvings":0,"cell_chars":16384,"cell_head_chars":4096},"cells_cut":0,"cells_raw":0,"read":"whole","date_system":"1900"}

{"sheet":"Introduction","index":0,"n_rows":0,"n_cols":0,"rows_kept":0,"cut":false,"hidden":false,"merged":[]}

{"sheet":"Breed Table","index":1,"n_rows":22,"n_cols":10,"rows_kept":22,"cut":false,"hidden":false,"merged":[]}
[1,2,3,4,5,6,7,8,9]
["Final 2018 Across Breed EPDs"]
[]
["Breed Code","Breed","Birth Wt ADJ Factor","Weaning Wt Adj Factor","Yearling Wt Adj Factor","Maternal Milk Adj Factor","Marbling Adj Factor","REA Adj Factor","Fat Thickness  Adj Factor","Carcass Wt Adj Factor"]
[1,"Angus",0,0,0,0,0,0,0,0]
[2,"Hereford",1.4,-16.5,-44.4,-12.5,-0.3,0.02,-7.2999999999999995E-2,-41.1]
[3,"Red Angus",2.6,-19.399999999999999,-31.4,1.5,-0.03,0.25,-0.04,-13.2]
[4,"Shorthorn",4.5,-34.4,-46.6,-0.1,-7.0000000000000007E-2,0.47,-3.2000000000000001E-2,5.6]
[5,"South Devon",2.6,-29.9,-55.4,3.1,-0.53,0.64,-0.21299999999999999,-68.8]
[6,"Beefmaster",4,23.4,1.1000000000000001,7.7,"NA","NA","NA","NA"]
[7,"Brahman",10.3,53.3,14.4,16.7,-0.64,0.03,-0.16600000000000001,-35.9]
[8,"Brangus",3.1,14.9,5.3,12.9,"NA","NA","NA","NA"]
[9,"Santa Gertrudis",5.2,40.4,39.799999999999997,16.8,-0.44,0.12,-8.5000000000000006E-2,-12.3]
[10,"Braunvieh",2.2000000000000002,-21.1,-46.6,4.0999999999999996,-0.61,1,-0.1,-53.4]
[11,"Charolais",6.6,32.700000000000003,23.2,8.1,-0.28999999999999998,0.79,-0.20100000000000001,5.0999999999999996]
{"$rows_left_out":8}
{"sheet":"Setting EPD Parameters","index":2,"n_rows":52,"n_cols":12,"rows_kept":52,"cut":false,"hidden":false,"merged":[[36,3,36,5],[40,3,41,5],[32,9,32,11],[36,9,36,11],[10,5,11,11],[15,3,15,5],[23,3,23,5],[23,9,23,11],[27,3,27,5],[14,3,14,5],[19,3,19,5],[3,5,7,11],[0,0,0,13],[51,3,52,5],[51,9,52,12],[40,6,41,6],[40,7,41,7],[15,9,15,11],[19,9,19,11],[14,9,14,11],[27,9,27,11],[32,3,32,5],[45,3,46,5],[46,9,46,11],[45,9,45,11],[40,9,40,11],[41,9,41,11]]}
["This sheet will allow you to compare EPD values according to a breed you are familiar with.  For example, if you typically purchase Limousin Bulls but have decided to purchase Charolais bulls, you can set the parameters for EPDs using Limousin numbers.  This spreadsheet will return EPD values for a Charolais bull that would have equivalent EPD values, reported on a Charolais basis (as you would see in the bull catalog)."]
[]
["Compare Desired Breed EPD"]
[]
["Breed A"]
[null,"Breed code"]
["Adjust to:",1]
[]
[]
["Breed B"]
[null,"Breed code",null,null,null,"If you receive (--), it is because not all breeds have Across-Breed Adjustment factors for some EPDs."]
["Adjust This Breed to Above:",17]
[]
[]
[null,null,null,{"$f":"VLOOKUP(B7,'Breed Table'!A$5:C$23,2)","v":"Angus"},null,null,null,null,null,{"$f":"VLOOKUP(B12,'Breed Table'!A$5:B$23,2)","v":"Simmental"}]
{"$rows_left_out":38}
{"sheet":"Compare Mulitple Sires","index":3,"n_rows":73,"n_cols":14,"rows_kept":73,"cut":false,"hidden":false,"merged":[[51,0,51,5],[24,0,24,5],[0,0,0,10],[1,0,2,12]]}
["This sheet will allow you to compare several different bulls of any breed.  All EPD's are converted to an Angus basis.  Choose the breed of the sire using the drop down box or by typing in the breed code (found on the Breed Table worksheet).  The first section allows you to input the EPD's published in the catalog.  The second section will display the adjusted EPD's on an ANGUS basis.  Section III allows you to choose the breed that the EPD's will be converted to and reported on that basis."]
["SECTION I:  Enter Sire ID, Breed Code and Published EPD"]
[]
["Notes","Sire ID","Breed Code","Breed","Catalog and pg","Published EPD BW","Across-Breed Adjustment (BW)","Published EPD WW","Published EPD YW","Published EPD Maternal Milk","Published EPD Marbling","Published EPD REA","Published EPD Fat Thickness","Published EPD CW"]
[null,"Comrade",1,null,"Select Sires",-3.5,null,46,90,27,0.56999999999999995,0.57999999999999996,-4.0000000000000001E-3,17]
[null,"Liberty",3,null,"Select Sires",-5.4,null,65,108,24,0.5,0.33,-0.02,27]
[null,"In Force",17,null,"Select Sires",-3.5,null,49.8,71.900000000000006,33.200000000000003,0.67,0.48,-7.0000000000000007E-2,3.3]
[null,"Sensation",2,null,"Select Sires",-1.1000000000000001,null,53,80,39,0.16,0.7,-2.5000000000000001E-2,73]
[]
[]
[]
[]
[]
[]
[]
{"$rows_left_out":59}
{"sheet":"Multiple Sire Hidden","index":4,"n_rows":23,"n_cols":17,"rows_kept":23,"cut":false,"hidden":true,"merged":[]}
[]
["II",null,null,null,null,null,null,null,null,"III"]
["Across-Breed Adjustment (BW)","Across-Breed Adjustment (WW)","Across-Breed Adjustment (YW)","Across-Breed Adjustment (MM)","Across-Breed Adjustment (Marbling)","Across-Breed Adjustment (REA)","Across-Breed Adjustment (Fat)","Across-Breed Adjustment (CW)",null,"Across-Breed Adjustment (BW)","Across-Breed Adjustment (WW)","Across-Breed Adjustment (YW)","Across-Breed Adjustment (MM)","Across-Breed Adjustment (Marbling)","Across-Breed Adjustment (REA)","Across-Breed Adjustment (Fat)","Across-Breed Adjustment (CW)"]
[{"$f":"VLOOKUP('Compare Mulitple Sires'!C5,'Breed Table'!A$5:J$22,3)","v":0},{"$f":"VLOOKUP('Compare Mulitple Sires'!C5,'Breed Table'!A$5:J$22,4)","v":0},{"$f":"VLOOKUP('Compare Mulitple Sires'!C5,'Breed Table'!A$5:J$22,5)","v":0},{"$f":"VLOOKUP('Compare Mulitple Sires'!C5,'Breed Table'!A$5:J$22,6)","v":0},{"$f":"VLOOKUP('Compare Mulitple Sires'!C5,'Breed Table'!A$5:J$22,7)","v":0},{"$f":"VLOOKUP('Compare Mulitple Sires'!C5,'Breed Table'!A$5:J$22,8)","v":0},{"$f":"VLOOKUP('Compare Mulitple Sires'!C5,'Breed Table'!A$5:J$22,9)","v":0},{"$f":"VLOOKUP('Compare Mulitple Sires'!C5,'Breed Table'!A$5:J$22,10)","v":0},null,{"$f":"VLOOKUP('Compare Mulitple Sires'!$G$52,'Breed Table'!A$5:J$22,3)","v":1.4},{"$f":"VLOOKUP('Compare Mulitple Sires'!$G$52,'Breed Table'!A$5:J$22,4)","v":-16.5},{"$f":"VLOOKUP('Compare Mulitple Sires'!$G$52,'Breed Table'!A$5:J$22,5)","v":-44.4},{"$f":"VLOOKUP('Compare Mulitple Sires'!$G$52,'Breed Table'!A$5:J$22,6)","v":-12.5},{"$f":"VLOOKUP('Compare Mulitple Sires'!$G$52,'Breed Table'!A$5:J$22,7)","v":-0.3},{"$f":"VLOOKUP('Compare Mulitple Sires'!$G$52,'Breed Table'!A$5:J$22,8)","v":0.02},{"$f":"VLOOKUP('Compare Mulitple Sires'!$G$52,'Breed Table'!A$5:J$22,9)","v":-7.2999999999999995E-2},{"$f":"VLOOKUP('Compare Mulitple Sires'!$G$52,'Breed Table'!A$5:J$22,10)","v":-41.1}]
[{"$f":"VLOOKUP('Compare Mulitple Sires'!C6,'Breed Table'!A$5:J$22,3)","v":2.6},{"$f":"VLOOKUP('Compare Mulitple Sires'!C6,'Breed Table'!A$5:J$22,4)","v":-19.399999999999999},{"$f":"VLOOKUP('Compare Mulitple Sires'!C6,'Breed Table'!A$5:J$22,5)","v":-31.4},{"$f":"VLOOKUP('Compare Mulitple Sires'!C6,'Breed Table'!A$5:J$22,6)","v":1.5},{"$f":"VLOOKUP('Compare Mulitple Sires'!C6,'Breed Table'!A$5:J$22,7)","v":-0.03},{"$f":"VLOOKUP('Compare Mulitple Sires'!C6,'Breed Table'!A$5:J$22,8)","v":0.25},{"$f":"VLOOKUP('Compare Mulitple Sires'!C6,'Breed Table'!A$5:J$22,9)","v":-0.04},{"$f":"VLOOKUP('Compare Mulitple Sires'!C6,'Breed Table'!A$5:J$22,10)","v":-13.2},null,{"$f":"VLOOKUP('Compare Mulitple Sires'!$G$52,'Breed Table'!A$5:J$22,3)","v":1.4},{"$f":"VLOOKUP('Compare Mulitple Sires'!$G$52,'Breed Table'!A$5:J$22,4)","v":-16.5},{"$f":"VLOOKUP('Compare Mulitple Sires'!$G$52,'Breed Table'!A$5:J$22,5)","v":-44.4},{"$f":"VLOOKUP('Compare Mulitple Sires'!$G$52,'Breed Table'!A$5:J$22,6)","v":-12.5},{"$f":"VLOOKUP('Compare Mulitple Sires'!$G$52,'Breed Table'!A$5:J$22,7)","v":-0.3},{"$f":"VLOOKUP('Compare Mulitple Sires'!$G$52,'Breed Table'!A$5:J$22,8)","v":0.02},{"$f":"VLOOKUP('Compare Mulitple Sires'!$G$52,'Breed Table'!A$5:J$22,9)","v":-7.2999999999999995E-2},{"$f":"VLOOKUP('Compare Mulitple Sires'!$G$52,'Breed Table'!A$5:J$22,10)","v":-41.1}]
[{"$f":"VLOOKUP('Compare Mulitple Sires'!C7,'Breed Table'!A$5:J$22,3)","v":2.8},{"$f":"VLOOKUP('Compare Mulitple Sires'!C7,'Breed Table'!A$5:J$22,4)","v":-11.6},{"$f":"VLOOKUP('Compare Mulitple Sires'!C7,'Breed Table'!A$5:J$22,5)","v":-19.2},{"$f":"VLOOKUP('Compare Mulitple Sires'!C7,'Breed Table'!A$5:J$22,6)","v":1.8},{"$f":"VLOOKUP('Compare Mulitple Sires'!C7,'Breed Table'!A$5:J$22,7)","v":-0.12},{"$f":"VLOOKUP('Compare Mulitple Sires'!C7,'Breed Table'!A$5:J$22,8)","v":0.45},{"$f":"VLOOKUP('Compare Mulitple Sires'!C7,'Breed Table'!A$5:J$22,9)","v":-4.9000000000000002E-2},{"$f":"VLOOKUP('Compare Mulitple Sires'!C7,'Breed Table'!A$5:J$22,10)","v":-7.5},null,{"$f":"VLOOKUP('Compare Mulitple Sires'!$G$52,'Breed Table'!A$5:J$22,3)","v":1.4},{"$f":"VLOOKUP('Compare Mulitple Sires'!$G$52,'Breed Table'!A$5:J$22,4)","v":-16.5},{"$f":"VLOOKUP('Compare Mulitple Sires'!$G$52,'Breed Table'!A$5:J$22,5)","v":-44.4},{"$f":"VLOOKUP('Compare Mulitple Sires'!$G$52,'Breed Table'!A$5:J$22,6)","v":-12.5},{"$f":"VLOOKUP('Compare Mulitple Sires'!$G$52,'Breed Table'!A$5:J$22,7)","v":-0.3},{"$f":"VLOOKUP('Compare Mulitple Sires'!$G$52,'Breed Table'!A$5:J$22,8)","v":0.02},{"$f":"VLOOKUP('Compare Mulitple Sires'!$G$52,'Breed Table'!A$5:J$22,9)","v":-7.2999999999999995E-2},{"$f":"VLOOKUP('Compare Mulitple Sires'!$G$52,'Breed Table'!A$5:J$22,10)","v":-41.1}]
[{"$f":"VLOOKUP('Compare Mulitple Sires'!C8,'Breed Table'!A$5:J$22,3)","v":1.4},{"$f":"VLOOKUP('Compare Mulitple Sires'!C8,'Breed Table'!A$5:J$22,4)","v":-16.5},{"$f":"VLOOKUP('Compare Mulitple Sires'!C8,'Breed Table'!A$5:J$22,5)","v":-44.4},{"$f":"VLOOKUP('Compare Mulitple Sires'!C8,'Breed Table'!A$5:J$22,6)","v":-12.5},{"$f":"VLOOKUP('Compare Mulitple Sires'!C8,'Breed Table'!A$5:J$22,7)","v":-0.3},{"$f":"VLOOKUP('Compare Mulitple Sires'!C8,'Breed Table'!A$5:J$22,8)","v":0.02},{"$f":"VLOOKUP('Compare Mulitple Sires'!C8,'Breed Table'!A$5:J$22,9)","v":-7.2999999999999995E-2},{"$f":"VLOOKUP('Compare Mulitple Sires'!C8,'Breed Table'!A$5:J$22,10)","v":-41.1},null,{"$f":"VLOOKUP('Compare Mulitple Sires'!$G$52,'Breed Table'!A$5:J$22,3)","v":1.4},{"$f":"VLOOKUP('Compare Mulitple Sires'!$G$52,'Breed Table'!A$5:J$22,4)","v":-16.5},{"$f":"VLOOKUP('Compare Mulitple Sires'!$G$52,'Breed Table'!A$5:J$22,5)","v":-44.4},{"$f":"VLOOKUP('Compare Mulitple Sires'!$G$52,'Breed Table'!A$5:J$22,6)","v":-12.5},{"$f":"VLOOKUP('Compare Mulitple Sires'!$G$52,'Breed Table'!A$5:J$22,7)","v":-0.3},{"$f":"VLOOKUP('Compare Mulitple Sires'!$G$52,'Breed Table'!A$5:J$22,8)","v":0.02},{"$f":"VLOOKUP('Compare Mulitple Sires'!$G$52,'Breed Table'!A$5:J$22,9)","v":-7.2999999999999995E-2},{"$f":"VLOOKUP('Compare Mulitple Sires'!$G$52,'Breed Table'!A$5:J$22,10)","v":-41.1}]
[{"$f":"VLOOKUP('Compare Mulitple Sires'!C9,'Breed Table'!A$5:J$22,3)","v":{"$error":"#N/A"}},{"$f":"VLOOKUP('Compare Mulitple Sires'!C9,'Breed Table'!A$5:J$22,4)","v":{"$error":"#N/A"}},{"$f":"VLOOKUP('Compare Mulitple Sires'!C9,'Breed Table'!A$5:J$22,5)","v":{"$error":"#N/A"}},{"$f":"VLOOKUP('Compare Mulitple Sires'!C9,'Breed Table'!A$5:J$22,6)","v":{"$error":"#N/A"}},{"$f":"VLOOKUP('Compare Mulitple Sires'!C9,'Breed Table'!A$5:J$22,7)","v":{"$error":"#N/A"}},{"$f":"VLOOKUP('Compare Mulitple Sires'!C9,'Breed Table'!A$5:J$22,8)","v":{"$error":"#N/A"}},{"$f":"VLOOKUP('Compare Mulitple Sires'!C9,'Breed Table'!A$5:J$22,9)","v":{"$error":"#N/A"}},{"$f":"VLOOKUP('Compare Mulitple Sires'!C9,'Breed Table'!A$5:J$22,10)","v":{"$error":"#N/A"}},null,{"$f":"VLOOKUP('Compare Mulitple Sires'!$G$52,'Breed Table'!A$5:J$22,3)","v":1.4},{"$f":"VLOOKUP('Compare Mulitple Sires'!$G$52,'Breed Table'!A$5:J$22,4)","v":-16.5},{"$f":"VLOOKUP('Compare Mulitple Sires'!$G$52,'Breed Table'!A$5:J$22,5)","v":-44.4},{"$f":"VLOOKUP('Compare Mulitple Sires'!$G$52,'Breed Table'!A$5:J$22,6)","v":-12.5},{"$f":"VLOOKUP('Compare Mulitple Sires'!$G$52,'Breed Table'!A$5:J$22,7)","v":-0.3},{"$f":"VLOOKUP('Compare Mulitple Sires'!$G$52,'Breed Table'!A$5:J$22,8)","v":0.02},{"$f":"VLOOKUP('Compare Mulitple Sires'!$G$52,'Breed Table'!A$5:J$22,9)","v":-7.2999999999999995E-2},{"$f":"VLOOKUP('Compare Mulitple Sires'!$G$52,'Breed Table'!A$5:J$22,10)","v":-41.1}]
[{"$f":"VLOOKUP('Compare Mulitple Sires'!C10,'Breed Table'!A$5:J$22,3)","v":{"$error":"#N/A"}},{"$f":"VLOOKUP('Compare Mulitple Sires'!C10,'Breed Table'!A$5:J$22,4)","v":{"$error":"#N/A"}},{"$f":"VLOOKUP('Compare Mulitple Sires'!C10,'Breed Table'!A$5:J$22,5)","v":{"$error":"#N/A"}},{"$f":"VLOOKUP('Compare Mulitple Sires'!C10,'Breed Table'!A$5:J$22,6)","v":{"$error":"#N/A"}},{"$f":"VLOOKUP('Compare Mulitple Sires'!C10,'Breed Table'!A$5:J$22,7)","v":{"$error":"#N/A"}},{"$f":"VLOOKUP('Compare Mulitple Sires'!C10,'Breed Table'!A$5:J$22,8)","v":{"$error":"#N/A"}},{"$f":"VLOOKUP('Compare Mulitple Sires'!C10,'Breed Table'!A$5:J$22,9)","v":{"$error":"#N/A"}},{"$f":"VLOOKUP('Compare Mulitple Sires'!C10,'Breed Table'!A$5:J$22,10)","v":{"$error":"#N/A"}},null,{"$f":"VLOOKUP('Compare Mulitple Sires'!$G$52,'Breed Table'!A$5:J$22,3)","v":1.4},{"$f":"VLOOKUP('Compare Mulitple Sires'!$G$52,'Breed Table'!A$5:J$22,4)","v":-16.5},{"$f":"VLOOKUP('Compare Mulitple Sires'!$G$52,'Breed Table'!A$5:J$22,5)","v":-44.4},{"$f":"VLOOKUP('Compare Mulitple Sires'!$G$52,'Breed Table'!A$5:J$22,6)","v":-12.5},{"$f":"VLOOKUP('Compare Mulitple Sires'!$G$52,'Breed Table'!A$5:J$22,7)","v":-0.3},{"$f":"VLOOKUP('Compare Mulitple Sires'!$G$52,'Breed Table'!A$5:J$22,8)","v":0.02},{"$f":"VLOOKUP('Compare Mulitple Sires'!$G$52,'Breed Table'!A$5:J$22,9)","v":-7.2999999999999995E-2},{"$f":"VLOOKUP('Compare Mulitple Sires'!$G$52,'Breed Table'!A$5:J$22,10)","v":-41.1}]
[{"$f":"VLOOKUP('Compare Mulitple Sires'!C11,'Breed Table'!A$5:J$22,3)","v":{"$error":"#N/A"}},{"$f":"VLOOKUP('Compare Mulitple Sires'!C11,'Breed Table'!A$5:J$22,4)","v":{"$error":"#N/A"}},{"$f":"VLOOKUP('Compare Mulitple Sires'!C11,'Breed Table'!A$5:J$22,5)","v":{"$error":"#N/A"}},{"$f":"VLOOKUP('Compare Mulitple Sires'!C11,'Breed Table'!A$5:J$22,6)","v":{"$error":"#N/A"}},{"$f":"VLOOKUP('Compare Mulitple Sires'!C11,'Breed Table'!A$5:J$22,7)","v":{"$error":"#N/A"}},{"$f":"VLOOKUP('Compare Mulitple Sires'!C11,'Breed Table'!A$5:J$22,8)","v":{"$error":"#N/A"}},{"$f":"VLOOKUP('Compare Mulitple Sires'!C11,'Breed Table'!A$5:J$22,9)","v":{"$error":"#N/A"}},{"$f":"VLOOKUP('Compare Mulitple Sires'!C11,'Breed Table'!A$5:J$22,10)","v":{"$error":"#N/A"}},null,{"$f":"VLOOKUP('Compare Mulitple Sires'!$G$52,'Breed Table'!A$5:J$22,3)","v":1.4},{"$f":"VLOOKUP('Compare Mulitple Sires'!$G$52,'Breed Table'!A$5:J$22,4)","v":-16.5},{"$f":"VLOOKUP('Compare Mulitple Sires'!$G$52,'Breed Table'!A$5:J$22,5)","v":-44.4},{"$f":"VLOOKUP('Compare Mulitple Sires'!$G$52,'Breed Table'!A$5:J$22,6)","v":-12.5},{"$f":"VLOOKUP('Compare Mulitple Sires'!$G$52,'Breed Table'!A$5:J$22,7)","v":-0.3},{"$f":"VLOOKUP('Compare Mulitple Sires'!$G$52,'Breed Table'!A$5:J$22,8)","v":0.02},{"$f":"VLOOKUP('Compare Mulitple Sires'!$G$52,'Breed Table'!A$5:J$22,9)","v":-7.2999999999999995E-2},{"$f":"VLOOKUP('Compare Mulitple Sires'!$G$52,'Breed Table'!A$5:J$22,10)","v":-41.1}]
[{"$f":"VLOOKUP('Compare Mulitple Sires'!C12,'Breed Table'!A$5:J$22,3)","v":{"$error":"#N/A"}},{"$f":"VLOOKUP('Compare Mulitple Sires'!C12,'Breed Table'!A$5:J$22,4)","v":{"$error":"#N/A"}},{"$f":"VLOOKUP('Compare Mulitple Sires'!C12,'Breed Table'!A$5:J$22,5)","v":{"$error":"#N/A"}},{"$f":"VLOOKUP('Compare Mulitple Sires'!C12,'Breed Table'!A$5:J$22,6)","v":{"$error":"#N/A"}},{"$f":"VLOOKUP('Compare Mulitple Sires'!C12,'Breed Table'!A$5:J$22,7)","v":{"$error":"#N/A"}},{"$f":"VLOOKUP('Compare Mulitple Sires'!C12,'Breed Table'!A$5:J$22,8)","v":{"$error":"#N/A"}},{"$f":"VLOOKUP('Compare Mulitple Sires'!C12,'Breed Table'!A$5:J$22,9)","v":{"$error":"#N/A"}},{"$f":"VLOOKUP('Compare Mulitple Sires'!C12,'Breed Table'!A$5:J$22,10)","v":{"$error":"#N/A"}},null,{"$f":"VLOOKUP('Compare Mulitple Sires'!$G$52,'Breed Table'!A$5:J$22,3)","v":1.4},{"$f":"VLOOKUP('Compare Mulitple Sires'!$G$52,'Breed Table'!A$5:J$22,4)","v":-16.5},{"$f":"VLOOKUP('Compare Mulitple Sires'!$G$52,'Breed Table'!A$5:J$22,5)","v":-44.4},{"$f":"VLOOKUP('Compare Mulitple Sires'!$G$52,'Breed Table'!A$5:J$22,6)","v":-12.5},{"$f":"VLOOKUP('Compare Mulitple Sires'!$G$52,'Breed Table'!A$5:J$22,7)","v":-0.3},{"$f":"VLOOKUP('Compare Mulitple Sires'!$G$52,'Breed Table'!A$5:J$22,8)","v":0.02},{"$f":"VLOOKUP('Compare Mulitple Sires'!$G$52,'Breed Table'!A$5:J$22,9)","v":-7.2999999999999995E-2},{"$f":"VLOOKUP('Compare Mulitple Sires'!$G$52,'Breed Table'!A$5:J$22,10)","v":-41.1}]
[{"$f":"VLOOKUP('Compare Mulitple Sires'!C13,'Breed Table'!A$5:J$22,3)","v":{"$error":"#N/A"}},{"$f":"VLOOKUP('Compare Mulitple Sires'!C13,'Breed Table'!A$5:J$22,4)","v":{"$error":"#N/A"}},{"$f":"VLOOKUP('Compare Mulitple Sires'!C13,'Breed Table'!A$5:J$22,5)","v":{"$error":"#N/A"}},{"$f":"VLOOKUP('Compare Mulitple Sires'!C13,'Breed Table'!A$5:J$22,6)","v":{"$error":"#N/A"}},{"$f":"VLOOKUP('Compare Mulitple Sires'!C13,'Breed Table'!A$5:J$22,7)","v":{"$error":"#N/A"}},{"$f":"VLOOKUP('Compare Mulitple Sires'!C13,'Breed Table'!A$5:J$22,8)","v":{"$error":"#N/A"}},{"$f":"VLOOKUP('Compare Mulitple Sires'!C13,'Breed Table'!A$5:J$22,9)","v":{"$error":"#N/A"}},{"$f":"VLOOKUP('Compare Mulitple Sires'!C13,'Breed Table'!A$5:J$22,10)","v":{"$error":"#N/A"}},null,{"$f":"VLOOKUP('Compare Mulitple Sires'!$G$52,'Breed Table'!A$5:J$22,3)","v":1.4},{"$f":"VLOOKUP('Compare Mulitple Sires'!$G$52,'Breed Table'!A$5:J$22,4)","v":-16.5},{"$f":"VLOOKUP('Compare Mulitple Sires'!$G$52,'Breed Table'!A$5:J$22,5)","v":-44.4},{"$f":"VLOOKUP('Compare Mulitple Sires'!$G$52,'Breed Table'!A$5:J$22,6)","v":-12.5},{"$f":"VLOOKUP('Compare Mulitple Sires'!$G$52,'Breed Table'!A$5:J$22,7)","v":-0.3},{"$f":"VLOOKUP('Compare Mulitple Sires'!$G$52,'Breed Table'!A$5:J$22,8)","v":0.02},{"$f":"VLOOKUP('Compare Mulitple Sires'!$G$52,'Breed Table'!A$5:J$22,9)","v":-7.2999999999999995E-2},{"$f":"VLOOKUP('Compare Mulitple Sires'!$G$52,'Breed Table'!A$5:J$22,10)","v":-41.1}]
[{"$f":"VLOOKUP('Compare Mulitple Sires'!C14,'Breed Table'!A$5:J$22,3)","v":{"$error":"#N/A"}},{"$f":"VLOOKUP('Compare Mulitple Sires'!C14,'Breed Table'!A$5:J$22,4)","v":{"$error":"#N/A"}},{"$f":"VLOOKUP('Compare Mulitple Sires'!C14,'Breed Table'!A$5:J$22,5)","v":{"$error":"#N/A"}},{"$f":"VLOOKUP('Compare Mulitple Sires'!C14,'Breed Table'!A$5:J$22,6)","v":{"$error":"#N/A"}},{"$f":"VLOOKUP('Compare Mulitple Sires'!C14,'Breed Table'!A$5:J$22,7)","v":{"$error":"#N/A"}},{"$f":"VLOOKUP('Compare Mulitple Sires'!C14,'Breed Table'!A$5:J$22,8)","v":{"$error":"#N/A"}},{"$f":"VLOOKUP('Compare Mulitple Sires'!C14,'Breed Table'!A$5:J$22,9)","v":{"$error":"#N/A"}},{"$f":"VLOOKUP('Compare Mulitple Sires'!C14,'Breed Table'!A$5:J$22,10)","v":{"$error":"#N/A"}},null,{"$f":"VLOOKUP('Compare Mulitple Sires'!$G$52,'Breed Table'!A$5:J$22,3)","v":1.4},{"$f":"VLOOKUP('Compare Mulitple Sires'!$G$52,'Breed Table'!A$5:J$22,4)","v":-16.5},{"$f":"VLOOKUP('Compare Mulitple Sires'!$G$52,'Breed Table'!A$5:J$22,5)","v":-44.4},{"$f":"VLOOKUP('Compare Mulitple Sires'!$G$52,'Breed Table'!A$5:J$22,6)","v":-12.5},{"$f":"VLOOKUP('Compare Mulitple Sires'!$G$52,'Breed Table'!A$5:J$22,7)","v":-0.3},{"$f":"VLOOKUP('Compare Mulitple Sires'!$G$52,'Breed Table'!A$5:J$22,8)","v":0.02},{"$f":"VLOOKUP('Compare Mulitple Sires'!$G$52,'Breed Table'!A$5:J$22,9)","v":-7.2999999999999995E-2},{"$f":"VLOOKUP('Compare Mulitple Sires'!$G$52,'Breed Table'!A$5:J$22,10)","v":-41.1}]
[{"$f":"VLOOKUP('Compare Mulitple Sires'!C15,'Breed Table'!A$5:J$22,3)","v":{"$error":"#N/A"}},{"$f":"VLOOKUP('Compare Mulitple Sires'!C15,'Breed Table'!A$5:J$22,4)","v":{"$error":"#N/A"}},{"$f":"VLOOKUP('Compare Mulitple Sires'!C15,'Breed Table'!A$5:J$22,5)","v":{"$error":"#N/A"}},{"$f":"VLOOKUP('Compare Mulitple Sires'!C15,'Breed Table'!A$5:J$22,6)","v":{"$error":"#N/A"}},{"$f":"VLOOKUP('Compare Mulitple Sires'!C15,'Breed Table'!A$5:J$22,7)","v":{"$error":"#N/A"}},{"$f":"VLOOKUP('Compare Mulitple Sires'!C15,'Breed Table'!A$5:J$22,8)","v":{"$error":"#N/A"}},{"$f":"VLOOKUP('Compare Mulitple Sires'!C15,'Breed Table'!A$5:J$22,9)","v":{"$error":"#N/A"}},{"$f":"VLOOKUP('Compare Mulitple Sires'!C15,'Breed Table'!A$5:J$22,10)","v":{"$error":"#N/A"}},null,{"$f":"VLOOKUP('Compare Mulitple Sires'!$G$52,'Breed Table'!A$5:J$22,3)","v":1.4},{"$f":"VLOOKUP('Compare Mulitple Sires'!$G$52,'Breed Table'!A$5:J$22,4)","v":-16.5},{"$f":"VLOOKUP('Compare Mulitple Sires'!$G$52,'Breed Table'!A$5:J$22,5)","v":-44.4},{"$f":"VLOOKUP('Compare Mulitple Sires'!$G$52,'Breed Table'!A$5:J$22,6)","v":-12.5},{"$f":"VLOOKUP('Compare Mulitple Sires'!$G$52,'Breed Table'!A$5:J$22,7)","v":-0.3},{"$f":"VLOOKUP('Compare Mulitple Sires'!$G$52,'Breed Table'!A$5:J$22,8)","v":0.02},{"$f":"VLOOKUP('Compare Mulitple Sires'!$G$52,'Breed Table'!A$5:J$22,9)","v":-7.2999999999999995E-2},{"$f":"VLOOKUP('Compare Mulitple Sires'!$G$52,'Breed Table'!A$5:J$22,10)","v":-41.1}]
[{"$f":"VLOOKUP('Compare Mulitple Sires'!C16,'Breed Table'!A$5:J$22,3)","v":{"$error":"#N/A"}},{"$f":"VLOOKUP('Compare Mulitple Sires'!C16,'Breed Table'!A$5:J$22,4)","v":{"$error":"#N/A"}},{"$f":"VLOOKUP('Compare Mulitple Sires'!C16,'Breed Table'!A$5:J$22,5)","v":{"$error":"#N/A"}},{"$f":"VLOOKUP('Compare Mulitple Sires'!C16,'Breed Table'!A$5:J$22,6)","v":{"$error":"#N/A"}},{"$f":"VLOOKUP('Compare Mulitple Sires'!C16,'Breed Table'!A$5:J$22,7)","v":{"$error":"#N/A"}},{"$f":"VLOOKUP('Compare Mulitple Sires'!C16,'Breed Table'!A$5:J$22,8)","v":{"$error":"#N/A"}},{"$f":"VLOOKUP('Compare Mulitple Sires'!C16,'Breed Table'!A$5:J$22,9)","v":{"$error":"#N/A"}},{"$f":"VLOOKUP('Compare Mulitple Sires'!C16,'Breed Table'!A$5:J$22,10)","v":{"$error":"#N/A"}},null,{"$f":"VLOOKUP('Compare Mulitple Sires'!$G$52,'Breed Table'!A$5:J$22,3)","v":1.4},{"$f":"VLOOKUP('Compare Mulitple Sires'!$G$52,'Breed Table'!A$5:J$22,4)","v":-16.5},{"$f":"VLOOKUP('Compare Mulitple Sires'!$G$52,'Breed Table'!A$5:J$22,5)","v":-44.4},{"$f":"VLOOKUP('Compare Mulitple Sires'!$G$52,'Breed Table'!A$5:J$22,6)","v":-12.5},{"$f":"VLOOKUP('Compare Mulitple Sires'!$G$52,'Breed Table'!A$5:J$22,7)","v":-0.3},{"$f":"VLOOKUP('Compare Mulitple Sires'!$G$52,'Breed Table'!A$5:J$22,8)","v":0.02},{"$f":"VLOOKUP('Compare Mulitple Sires'!$G$52,'Breed Table'!A$5:J$22,9)","v":-7.2999999999999995E-2},{"$f":"VLOOKUP('Compare Mulitple Sires'!$G$52,'Breed Table'!A$5:J$22,10)","v":-41.1}]
{"$rows_left_out":8}