{"text_format":"1","workbook":"xlsx","n_sheets":5,"sheets":["Introduction","Breed Table","Setting EPD Parameters","Compare Mulitple Sires","Multiple Sire Hidden"],"not_rendered":{"charts":0,"images":2,"macros":1,"external_links":0,"defined_names":1,"comments":1,"pivot_tables":0},"unopened":[],"bounds":{"document_bytes":16777216,"sheet_cells":100000,"rows_first":2000,"rows_last":500,"rows_between":2000,"halvings":0,"cell_chars":16384,"cell_head_chars":4096},"cells_cut":0,"cells_raw":0,"read":"whole","date_system":"1900"}

{"sheet":"Introduction","index":0,"n_rows":0,"n_cols":0,"rows_kept":0,"cut":false,"hidden":false,"merged":[]}

{"sheet":"Breed Table","index":1,"n_rows":22,"n_cols":10,"rows_kept":22,"cut":false,"hidden":false,"merged":[]}
[1,2,3,4,5,6,7,8,9]
["Final 2018 Across Breed EPDs"]
[]
["Breed Code","Breed","Birth Wt ADJ Factor","Weaning Wt Adj Factor","Yearling Wt Adj Factor","Maternal Milk Adj Factor","Marbling Adj Factor","REA Adj Factor","Fat Thickness  Adj Factor","Carcass Wt Adj Factor"]
[1,"Angus",0,0,0,0,0,0,0,0]
[2,"Hereford",1.4,-16.5,-44.4,-12.5,-0.3,0.02,-7.2999999999999995E-2,-41.1]
[3,"Red Angus",2.6,-19.399999999999999,-31.4,1.5,-0.03,0.25,-0.04,-13.2]
[4,"Shorthorn",4.5,-34.4,-46.6,-0.1,-7.0000000000000007E-2,0.47,-3.2000000000000001E-2,5.6]
[5,"South Devon",2.6,-29.9,-55.4,3.1,-0.53,0.64,-0.21299999999999999,-68.8]
[6,"Beefmaster",4,23.4,1.1000000000000001,7.7,"NA","NA","NA","NA"]
[7,"Brahman",10.3,53.3,14.4,16.7,-0.64,0.03,-0.16600000000000001,-35.9]
[8,"Brangus",3.1,14.9,5.3,12.9,"NA","NA","NA","NA"]
[9,"Santa Gertrudis",5.2,40.4,39.799999999999997,16.8,-0.44,0.12,-8.5000000000000006E-2,-12.3]
[10,"Braunvieh",2.2000000000000002,-21.1,-46.6,4.0999999999999996,-0.61,1,-0.1,-53.4]
[11,"Charolais",6.6,32.700000000000003,23.2,8.1,-0.28999999999999998,0.79,-0.20100000000000001,5.0999999999999996]
[12,"Chiangus",2.8,-21.1,-36.200000000000003,2.5,-0.47,0.59,-0.14199999999999999,-19.3]
[13,"Gelbvieh",2.9,-15.5,-27.1,8.1999999999999993,-0.37,0.66,-6.6000000000000003E-2,1.5]
[14,"Limousin",2.5,-16.899999999999999,-53.9,-2.4,-0.03,0.59,-2.4E-2,-5.0999999999999996]
[15,"Main-Anjou",2.4,-30.3,-55.2,-7,-0.43,0.95,-0.17899999999999999,-35.1]
[16,"Salers",0.9,-11.2,-48,5.6,7.0000000000000007E-2,1.08,-0.17699999999999999,-47.6]
[17,"Simmental",2.8,-11.6,-19.2,1.8,-0.12,0.45,-4.9000000000000002E-2,-7.5]
[18,"Tarentaise",2.7,20.2,-12.1,15.7,"NA","NA","NA","NA"]

{"sheet":"Setting EPD Parameters","index":2,"n_rows":52,"n_cols":12,"rows_kept":52,"cut":false,"hidden":false,"merged":[[36,3,36,5],[40,3,41,5],[32,9,32,11],[36,9,36,11],[10,5,11,11],[15,3,15,5],[23,3,23,5],[23,9,23,11],[27,3,27,5],[14,3,14,5],[19,3,19,5],[3,5,7,11],[0,0,0,13],[51,3,52,5],[51,9,52,12],[40,6,41,6],[40,7,41,7],[15,9,15,11],[19,9,19,11],[14,9,14,11],[27,9,27,11],[32,3,32,5],[45,3,46,5],[46,9,46,11],[45,9,45,11],[40,9,40,11],[41,9,41,11]]}
["This sheet will allow you to compare EPD values according to a breed you are familiar with.  For example, if you typically purchase Limousin Bulls but have decided to purchase Charolais bulls, you can set the parameters for EPDs using Limousin numbers.  This spreadsheet will return EPD values for a Charolais bull that would have equivalent EPD values, reported on a Charolais basis (as you would see in the bull catalog)."]
[]
["Compare Desired Breed EPD"]
[]
["Breed A"]
[null,"Breed code"]
["Adjust to:",1]
[]
[]
["Breed B"]
[null,"Breed code",null,null,null,"If you receive (--), it is because not all breeds have Across-Breed Adjustment factors for some EPDs."]
["Adjust This Breed to Above:",17]
[]
[]
[null,null,null,{"$f":"VLOOKUP(B7,'Breed Table'!A$5:C$23,2)","v":"Angus"},null,null,null,null,null,{"$f":"VLOOKUP(B12,'Breed Table'!A$5:B$23,2)","v":"Simmental"}]
[null,null,null,"Desired EPD for BW ",null,null,null,null,null,"Comparable BW"]
[null,null,null,0,null,2,{"$f":"VLOOKUP(B7,'Breed Table'!A5:J22,3)","v":0},{"$f":"VLOOKUP(B12,'Breed Table'!A5:J22,3)","v":2.8},null,{"$f":"IFERROR((D17+G17)-H17,\"--\")","v":-2.8},null,{"$f":"IFERROR((F17+G17)-H17,\"--\")","v":-0.79999999999999982}]
[]
[]
[null,null,null,"Desired EPD WW",null,null,"Across-Breed Adjustment (BW)","Across-Breed Adjustment (BW)",null,"Comparable WW"]
[null,null,null,41,null,50,{"$f":"VLOOKUP(B7,'Breed Table'!A5:J25,4)","v":0},{"$f":"VLOOKUP(B12,'Breed Table'!A5:D25,4)","v":-11.6},null,{"$f":"IFERROR((D21+G21)-H21,\"--\")","v":52.6},null,{"$f":"IFERROR((F21+G21)-H21,\"--\")","v":61.6}]
[]
[]
[null,null,null,"Desired EPD YW",null,null,"Across-Breed Adjustment (WW)","Across-Breed Adjustment (WW)",null,"Comparable YW"]
[null,null,null,0,null,0,{"$f":"VLOOKUP(B7,'Breed Table'!A5:E25,5)","v":0},{"$f":"VLOOKUP(B12,'Breed Table'!A5:E25,5)","v":-19.2},null,{"$f":"IFERROR((D25+G25)-H25,\"--\")","v":19.2},null,{"$f":"IFERROR((F25+G25)-H25,\"--\")","v":19.2}]
[]
[]
[null,null,null,"Desired EPD Maternal Milk",null,null,"Across-Breed Adjustment (MM)","Across-Breed Adjustment (MM)",null,"Comparable MM"]
[null,null,null,null,null,null,{"$f":"VLOOKUP(B7,'Breed Table'!A5:F24,6)","v":0},{"$f":"VLOOKUP(B12,'Breed Table'!A5:F24,6)","v":1.8}]
[null,null,null,20,null,25,{"$f":"VLOOKUP(B7,'Breed Table'!A5:F24,6)","v":0},{"$f":"VLOOKUP(B12,'Breed Table'!A5:F24,6)","v":1.8},null,{"$f":"IFERROR((D30+G30)-H30,\"--\")","v":18.2},null,{"$f":"IFERROR((F30+G30)-H30,\"--\")","v":23.2}]
[]
[]
[null,null,null,"Desired EPD Marbling",null,null,"Across-Breed Adjustment (Marb)","Across-Breed Adjustment (Marb)",null,"Comparable Marbling"]
[null,null,null,0.2,null,0.5,{"$f":"VLOOKUP(B7,'Breed Table'!A5:J29,7)","v":0},{"$f":"VLOOKUP(B12,'Breed Table'!A5:J24,7)","v":-0.12},null,{"$f":"IFERROR((D34+G34)-H34,\"--\")","v":0.32},null,{"$f":"IFERROR((F34+G34)-H34,\"--\")","v":0.62}]
[]
[]
[null,null,null,"Desired EPD REA",null,null,"Across-Breed Adjustment (REA)","Across-Breed Adjustment (REA)",null,"Comparable REA"]
[null,null,null,0.2,null,0.5,{"$f":"VLOOKUP(B7,'Breed Table'!A5:H24,8)","v":0},{"$f":"VLOOKUP(B12,'Breed Table'!A5:H24,8)","v":0.45},null,{"$f":"IFERROR((D38+G38)-H38,\"--\")","v":-0.25},null,{"$f":"IFERROR((F38+G38)-H38,\"--\")","v":4.9999999999999989E-2}]
[]
[]
[null,null,null,"Desired EPD Fat Thickness",null,null,"Across-Breed Adjustment (BF)","Across-Breed Adjustment (BF)"]
[null,null,null,null,null,null,null,null,null,"Comparable Fat Thickness"]
[null,null,null,0,null,0.05,{"$f":"VLOOKUP(B7,'Breed Table'!A5:I24,9)","v":0},{"$f":"VLOOKUP(B12,'Breed Table'!A5:I24,9)","v":-4.9000000000000002E-2},null,{"$f":"IFERROR((D43+G43)-H43,\"--\")","v":4.9000000000000002E-2},null,{"$f":"IFERROR((F43+G43)-H43,\"--\")","v":9.9000000000000005E-2}]
[]
[]
[null,null,null,"Desired EPD Carcass Wt."]
[null,null,null,null,null,null,"Across-Breed Adjustment (CW) ","Across-Breed Adjustment (CW) ",null,"Comparable CW"]
[null,null,null,10,null,50,{"$f":"VLOOKUP(B7,'Breed Table'!A5:J24,10)","v":0},{"$f":"VLOOKUP(B12,'Breed Table'!A5:J24,10)","v":-7.5},null,{"$f":"IFERROR((D48+G48)-H48,\"--\")","v":17.5},null,{"$f":"IFERROR((F48+G48)-H48,\"--\")","v":57.5}]
[]
[]
[]
[null,null,null,"Parameters entered reflect the breed of bull you are familiar with.",null,null,null,null,null,"Comparable EPD's are the equivalent values reported for the breed you are looking to purchase (as printed in their catalog)."]

{"sheet":"Compare Mulitple Sires","index":3,"n_rows":73,"n_cols":14,"rows_kept":73,"cut":false,"hidden":false,"merged":[[51,0,51,5],[24,0,24,5],[0,0,0,10],[1,0,2,12]]}
["This sheet will allow you to compare several different bulls of any breed.  All EPD's are converted to an Angus basis.  Choose the breed of the sire using the drop down box or by typing in the breed code (found on the Breed Table worksheet).  The first section allows you to input the EPD's published in the catalog.  The second section will display the adjusted EPD's on an ANGUS basis.  Section III allows you to choose the breed that the EPD's will be converted to and reported on that basis."]
["SECTION I:  Enter Sire ID, Breed Code and Published EPD"]
[]
["Notes","Sire ID","Breed Code","Breed","Catalog and pg","Published EPD BW","Across-Breed Adjustment (BW)","Published EPD WW","Published EPD YW","Published EPD Maternal Milk","Published EPD Marbling","Published EPD REA","Published EPD Fat Thickness","Published EPD CW"]
[null,"Comrade",1,null,"Select Sires",-3.5,null,46,90,27,0.56999999999999995,0.57999999999999996,-4.0000000000000001E-3,17]
[null,"Liberty",3,null,"Select Sires",-5.4,null,65,108,24,0.5,0.33,-0.02,27]
[null,"In Force",17,null,"Select Sires",-3.5,null,49.8,71.900000000000006,33.200000000000003,0.67,0.48,-7.0000000000000007E-2,3.3]
[null,"Sensation",2,null,"Select Sires",-1.1000000000000001,null,53,80,39,0.16,0.7,-2.5000000000000001E-2,73]
[]
[]
[]
[]
[]
[]
[]
[]
[]
[]
[]
[]
[]
[]
[]
[]
["SECTION II:  Computer Generated Across Breed EPD Comparison of Sires: Angus Basis"]
[null,"Sire ID","Breed Code","Breed",null,"Across-Breed Birth Wt","Across-Breed Adjustment (BW)","Across-Breed Weaning Wt","Across-Breed Yearling Wt","Across-Breed Maternal Milk","*Across-Breed Marbling","*Across-Breed REA","*Across-Breed Fat Thickness","*Across-Breed Carcass Wt"]
[{"$f":"IF(A5=0, \"\", A5)","v":""},{"$f":"IF(B5=0, \"\", B5)","v":"Comrade"},{"$f":"IF(C5=0, \"\", C5)","v":1},{"$f":"IF(C5=0,\"\",VLOOKUP(C27,'Breed Table'!$A$5:$B$22,2))","v":"Angus"},{"$f":"IF(E5=0, \"\", E5)","v":"Select Sires"},{"$f":"IF(F5=\"\",\"--\",IFERROR(IF(C5=0,\"\",'Multiple Sire Hidden'!$A4+F5),\"--\"))","v":-3.5},null,{"$f":"IF(H5=\"\",\"--\",IFERROR(IF(C5=0,\"\",H5+'Multiple Sire Hidden'!$B4),\"--\"))","v":46},{"$f":"IF(I5=\"\",\"--\",IFERROR(IF(C5=0,\"\",I5+'Multiple Sire Hidden'!$C4),\"--\"))","v":90},{"$f":"IF(J5=\"\",\"--\",IFERROR(IF(C5=0,\"\",J5+'Multiple Sire Hidden'!$D4),\"--\"))","v":27},{"$f":"IF(K5=\"\",\"--\",IFERROR(IF(C5=0,\"\",K5+'Multiple Sire Hidden'!$E4),\"--\"))","v":0.56999999999999995},{"$f":"IF(L5=\"\",\"--\",IFERROR(IF(C5=0,\"\",L5+'Multiple Sire Hidden'!$F4),\"--\"))","v":0.57999999999999996},{"$f":"IF(M5=\"\", \"--\", IFERROR(IF(C5=0,\"\",M5+'Multiple Sire Hidden'!$G4),\"--\"))","v":-4.0000000000000001E-3},{"$f":"IF(N5=\"\",\"--\",IFERROR(IF(C5=0,\"\",N5+'Multiple Sire Hidden'!$H4),\"--\"))","v":17}]
[{"$f":"IF(A6=0, \"\", A6)","v":""},"Liberty",3,{"$f":"IF(C6=0,\"\",VLOOKUP(C28,'Breed Table'!$A$5:$B$22,2))","v":"Red Angus"},{"$f":"IF(E6=0, \"\", E6)","v":"Select Sires"},{"$f":"IF(F6=\"\",\"--\",IFERROR(IF(C6=0,\"\",'Multiple Sire Hidden'!$A5+F6),\"--\"))","v":-2.8000000000000003},null,{"$f":"IF(H6=\"\",\"--\",IFERROR(IF(C6=0,\"\",H6+'Multiple Sire Hidden'!$B5),\"--\"))","v":45.6},{"$f":"IF(I6=\"\",\"--\",IFERROR(IF(C6=0,\"\",I6+'Multiple Sire Hidden'!$C5),\"--\"))","v":76.599999999999994},{"$f":"IF(J6=\"\",\"--\",IFERROR(IF(C6=0,\"\",J6+'Multiple Sire Hidden'!$D5),\"--\"))","v":25.5},{"$f":"IF(K6=\"\",\"--\",IFERROR(IF(C6=0,\"\",K6+'Multiple Sire Hidden'!$E5),\"--\"))","v":0.47},{"$f":"IF(L6=\"\",\"--\",IFERROR(IF(C6=0,\"\",L6+'Multiple Sire Hidden'!$F5),\"--\"))","v":0.58000000000000007},{"$f":"IF(M6=\"\", \"--\", IFERROR(IF(C6=0,\"\",M6+'Multiple Sire Hidden'!$G5),\"--\"))","v":-0.06},{"$f":"IF(N6=\"\",\"--\",IFERROR(IF(C6=0,\"\",N6+'Multiple Sire Hidden'!$H5),\"--\"))","v":13.8}]
["","In Force",17,{"$f":"IF(C7=0,\"\",VLOOKUP(C29,'Breed Table'!$A$5:$B$22,2))","v":"Simmental"},"Select Sires",{"$f":"IF(F7=\"\",\"--\",IFERROR(IF(C7=0,\"\",'Multiple Sire Hidden'!$A6+F7),\"--\"))","v":-0.70000000000000018},null,{"$f":"IF(H7=\"\",\"--\",IFERROR(IF(C7=0,\"\",H7+'Multiple Sire Hidden'!$B6),\"--\"))","v":38.199999999999996},{"$f":"IF(I7=\"\",\"--\",IFERROR(IF(C7=0,\"\",I7+'Multiple Sire Hidden'!$C6),\"--\"))","v":52.7},{"$f":"IF(J7=\"\",\"--\",IFERROR(IF(C7=0,\"\",J7+'Multiple Sire Hidden'!$D6),\"--\"))","v":35},{"$f":"IF(K7=\"\",\"--\",IFERROR(IF(C7=0,\"\",K7+'Multiple Sire Hidden'!$E6),\"--\"))","v":0.55000000000000004},{"$f":"IF(L7=\"\",\"--\",IFERROR(IF(C7=0,\"\",L7+'Multiple Sire Hidden'!$F6),\"--\"))","v":0.92999999999999994},{"$f":"IF(M7=\"\", \"--\", IFERROR(IF(C7=0,\"\",M7+'Multiple Sire Hidden'!$G6),\"--\"))","v":-0.11900000000000001},{"$f":"IF(N7=\"\",\"--\",IFERROR(IF(C7=0,\"\",N7+'Multiple Sire Hidden'!$H6),\"--\"))","v":-4.2}]
["","Sensation",2,{"$f":"IF(C8=0,\"\",VLOOKUP(C30,'Breed Table'!$A$5:$B$22,2))","v":"Hereford"},"Select Sires",{"$f":"IF(F8=\"\",\"--\",IFERROR(IF(C8=0,\"\",'Multiple Sire Hidden'!$A7+F8),\"--\"))","v":0.29999999999999982},null,{"$f":"IF(H8=\"\",\"--\",IFERROR(IF(C8=0,\"\",H8+'Multiple Sire Hidden'!$B7),\"--\"))","v":36.5},{"$f":"IF(I8=\"\",\"--\",IFERROR(IF(C8=0,\"\",I8+'Multiple Sire Hidden'!$C7),\"--\"))","v":35.6},{"$f":"IF(J8=\"\",\"--\",IFERROR(IF(C8=0,\"\",J8+'Multiple Sire Hidden'!$D7),\"--\"))","v":26.5},{"$f":"IF(K8=\"\",\"--\",IFERROR(IF(C8=0,\"\",K8+'Multiple Sire Hidden'!$E7),\"--\"))","v":-0.13999999999999999},{"$f":"IF(L8=\"\",\"--\",IFERROR(IF(C8=0,\"\",L8+'Multiple Sire Hidden'!$F7),\"--\"))","v":0.72},{"$f":"IF(M8=\"\", \"--\", IFERROR(IF(C8=0,\"\",M8+'Multiple Sire Hidden'!$G7),\"--\"))","v":-9.8000000000000004E-2},{"$f":"IF(N8=\"\",\"--\",IFERROR(IF(C8=0,\"\",N8+'Multiple Sire Hidden'!$H7),\"--\"))","v":31.9}]
["","","",{"$f":"IF(C9=0,\"\",VLOOKUP(C31,'Breed Table'!$A$5:$B$22,2))","v":""},"",{"$f":"IF(F9=\"\",\"--\",IFERROR(IF(C9=0,\"\",'Multiple Sire Hidden'!$A8+F9),\"--\"))","v":"--"},null,{"$f":"IF(H9=\"\",\"--\",IFERROR(IF(C9=0,\"\",H9+'Multiple Sire Hidden'!$B8),\"--\"))","v":"--"},{"$f":"IF(I9=\"\",\"--\",IFERROR(IF(C9=0,\"\",I9+'Multiple Sire Hidden'!$C8),\"--\"))","v":"--"},{"$f":"IF(J9=\"\",\"--\",IFERROR(IF(C9=0,\"\",J9+'Multiple Sire Hidden'!$D8),\"--\"))","v":"--"},{"$f":"IF(K9=\"\",\"--\",IFERROR(IF(C9=0,\"\",K9+'Multiple Sire Hidden'!$E8),\"--\"))","v":"--"},{"$f":"IF(L9=\"\",\"--\",IFERROR(IF(C9=0,\"\",L9+'Multiple Sire Hidden'!$F8),\"--\"))","v":"--"},{"$f":"IF(M9=\"\", \"--\", IFERROR(IF(C9=0,\"\",M9+'Multiple Sire Hidden'!$G8),\"--\"))","v":"--"},{"$f":"IF(N9=\"\",\"--\",IFERROR(IF(C9=0,\"\",N9+'Multiple Sire Hidden'!$H8),\"--\"))","v":"--"}]
["","","",{"$f":"IF(C10=0,\"\",VLOOKUP(C32,'Breed Table'!$A$5:$B$22,2))","v":""},"",{"$f":"IF(F10=\"\",\"--\",IFERROR(IF(C10=0,\"\",'Multiple Sire Hidden'!$A9+F10),\"--\"))","v":"--"},null,{"$f":"IF(H10=\"\",\"--\",IFERROR(IF(C10=0,\"\",H10+'Multiple Sire Hidden'!$B9),\"--\"))","v":"--"},{"$f":"IF(I10=\"\",\"--\",IFERROR(IF(C10=0,\"\",I10+'Multiple Sire Hidden'!$C9),\"--\"))","v":"--"},{"$f":"IF(J10=\"\",\"--\",IFERROR(IF(C10=0,\"\",J10+'Multiple Sire Hidden'!$D9),\"--\"))","v":"--"},{"$f":"IF(K10=\"\",\"--\",IFERROR(IF(C10=0,\"\",K10+'Multiple Sire Hidden'!$E9),\"--\"))","v":"--"},{"$f":"IF(L10=\"\",\"--\",IFERROR(IF(C10=0,\"\",L10+'Multiple Sire Hidden'!$F9),\"--\"))","v":"--"},{"$f":"IF(M10=\"\", \"--\", IFERROR(IF(C10=0,\"\",M10+'Multiple Sire Hidden'!$G9),\"--\"))","v":"--"},{"$f":"IF(N10=\"\",\"--\",IFERROR(IF(C10=0,\"\",N10+'Multiple Sire Hidden'!$H9),\"--\"))","v":"--"}]
["","","",{"$f":"IF(C11=0,\"\",VLOOKUP(C33,'Breed Table'!$A$5:$B$22,2))","v":""},"",{"$f":"IF(F11=\"\",\"--\",IFERROR(IF(C11=0,\"\",'Multiple Sire Hidden'!$A10+F11),\"--\"))","v":"--"},null,{"$f":"IF(H11=\"\",\"--\",IFERROR(IF(C11=0,\"\",H11+'Multiple Sire Hidden'!$B10),\"--\"))","v":"--"},{"$f":"IF(I11=\"\",\"--\",IFERROR(IF(C11=0,\"\",I11+'Multiple Sire Hidden'!$C10),\"--\"))","v":"--"},{"$f":"IF(J11=\"\",\"--\",IFERROR(IF(C11=0,\"\",J11+'Multiple Sire Hidden'!$D10),\"--\"))","v":"--"},{"$f":"IF(K11=\"\",\"--\",IFERROR(IF(C11=0,\"\",K11+'Multiple Sire Hidden'!$E10),\"--\"))","v":"--"},{"$f":"IF(L11=\"\",\"--\",IFERROR(IF(C11=0,\"\",L11+'Multiple Sire Hidden'!$F10),\"--\"))","v":"--"},{"$f":"IF(M11=\"\", \"--\", IFERROR(IF(C11=0,\"\",M11+'Multiple Sire Hidden'!$G10),\"--\"))","v":"--"},{"$f":"IF(N11=\"\",\"--\",IFERROR(IF(C11=0,\"\",N11+'Multiple Sire Hidden'!$H10),\"--\"))","v":"--"}]
["","","",{"$f":"IF(C12=0,\"\",VLOOKUP(C34,'Breed Table'!$A$5:$B$22,2))","v":""},"",{"$f":"IF(F12=\"\",\"--\",IFERROR(IF(C12=0,\"\",'Multiple Sire Hidden'!$A11+F12),\"--\"))","v":"--"},null,{"$f":"IF(H12=\"\",\"--\",IFERROR(IF(C12=0,\"\",H12+'Multiple Sire Hidden'!$B11),\"--\"))","v":"--"},{"$f":"IF(I12=\"\",\"--\",IFERROR(IF(C12=0,\"\",I12+'Multiple Sire Hidden'!$C11),\"--\"))","v":"--"},{"$f":"IF(J12=\"\",\"--\",IFERROR(IF(C12=0,\"\",J12+'Multiple Sire Hidden'!$D11),\"--\"))","v":"--"},{"$f":"IF(K12=\"\",\"--\",IFERROR(IF(C12=0,\"\",K12+'Multiple Sire Hidden'!$E11),\"--\"))","v":"--"},{"$f":"IF(L12=\"\",\"--\",IFERROR(IF(C12=0,\"\",L12+'Multiple Sire Hidden'!$F11),\"--\"))","v":"--"},{"$f":"IF(M12=\"\", \"--\", IFERROR(IF(C12=0,\"\",M12+'Multiple Sire Hidden'!$G11),\"--\"))","v":"--"},{"$f":"IF(N12=\"\",\"--\",IFERROR(IF(C12=0,\"\",N12+'Multiple Sire Hidden'!$H11),\"--\"))","v":"--"}]
["","","",{"$f":"IF(C13=0,\"\",VLOOKUP(C35,'Breed Table'!$A$5:$B$22,2))","v":""},"",{"$f":"IF(F13=\"\",\"--\",IFERROR(IF(C13=0,\"\",'Multiple Sire Hidden'!$A12+F13),\"--\"))","v":"--"},null,{"$f":"IF(H13=\"\",\"--\",IFERROR(IF(C13=0,\"\",H13+'Multiple Sire Hidden'!$B12),\"--\"))","v":"--"},{"$f":"IF(I13=\"\",\"--\",IFERROR(IF(C13=0,\"\",I13+'Multiple Sire Hidden'!$C12),\"--\"))","v":"--"},{"$f":"IF(J13=\"\",\"--\",IFERROR(IF(C13=0,\"\",J13+'Multiple Sire Hidden'!$D12),\"--\"))","v":"--"},{"$f":"IF(K13=\"\",\"--\",IFERROR(IF(C13=0,\"\",K13+'Multiple Sire Hidden'!$E12),\"--\"))","v":"--"},{"$f":"IF(L13=\"\",\"--\",IFERROR(IF(C13=0,\"\",L13+'Multiple Sire Hidden'!$F12),\"--\"))","v":"--"},{"$f":"IF(M13=\"\", \"--\", IFERROR(IF(C13=0,\"\",M13+'Multiple Sire Hidden'!$G12),\"--\"))","v":"--"},{"$f":"IF(N13=\"\",\"--\",IFERROR(IF(C13=0,\"\",N13+'Multiple Sire Hidden'!$H12),\"--\"))","v":"--"}]
["","","",{"$f":"IF(C14=0,\"\",VLOOKUP(C36,'Breed Table'!$A$5:$B$22,2))","v":""},"",{"$f":"IF(F14=\"\",\"--\",IFERROR(IF(C14=0,\"\",'Multiple Sire Hidden'!$A13+F14),\"--\"))","v":"--"},null,{"$f":"IF(H14=\"\",\"--\",IFERROR(IF(C14=0,\"\",H14+'Multiple Sire Hidden'!$B13),\"--\"))","v":"--"},{"$f":"IF(I14=\"\",\"--\",IFERROR(IF(C14=0,\"\",I14+'Multiple Sire Hidden'!$C13),\"--\"))","v":"--"},{"$f":"IF(J14=\"\",\"--\",IFERROR(IF(C14=0,\"\",J14+'Multiple Sire Hidden'!$D13),\"--\"))","v":"--"},{"$f":"IF(K14=\"\",\"--\",IFERROR(IF(C14=0,\"\",K14+'Multiple Sire Hidden'!$E13),\"--\"))","v":"--"},{"$f":"IF(L14=\"\",\"--\",IFERROR(IF(C14=0,\"\",L14+'Multiple Sire Hidden'!$F13),\"--\"))","v":"--"},{"$f":"IF(M14=\"\", \"--\", IFERROR(IF(C14=0,\"\",M14+'Multiple Sire Hidden'!$G13),\"--\"))","v":"--"},{"$f":"IF(N14=\"\",\"--\",IFERROR(IF(C14=0,\"\",N14+'Multiple Sire Hidden'!$H13),\"--\"))","v":"--"}]
["","","",{"$f":"IF(C15=0,\"\",VLOOKUP(C37,'Breed Table'!$A$5:$B$22,2))","v":""},"",{"$f":"IF(F15=\"\",\"--\",IFERROR(IF(C15=0,\"\",'Multiple Sire Hidden'!$A14+F15),\"--\"))","v":"--"},null,{"$f":"IF(H15=\"\",\"--\",IFERROR(IF(C15=0,\"\",H15+'Multiple Sire Hidden'!$B14),\"--\"))","v":"--"},{"$f":"IF(I15=\"\",\"--\",IFERROR(IF(C15=0,\"\",I15+'Multiple Sire Hidden'!$C14),\"--\"))","v":"--"},{"$f":"IF(J15=\"\",\"--\",IFERROR(IF(C15=0,\"\",J15+'Multiple Sire Hidden'!$D14),\"--\"))","v":"--"},{"$f":"IF(K15=\"\",\"--\",IFERROR(IF(C15=0,\"\",K15+'Multiple Sire Hidden'!$E14),\"--\"))","v":"--"},{"$f":"IF(L15=\"\",\"--\",IFERROR(IF(C15=0,\"\",L15+'Multiple Sire Hidden'!$F14),\"--\"))","v":"--"},{"$f":"IF(M15=\"\", \"--\", IFERROR(IF(C15=0,\"\",M15+'Multiple Sire Hidden'!$G14),\"--\"))","v":"--"},{"$f":"IF(N15=\"\",\"--\",IFERROR(IF(C15=0,\"\",N15+'Multiple Sire Hidden'!$H14),\"--\"))","v":"--"}]
["","","",{"$f":"IF(C16=0,\"\",VLOOKUP(C38,'Breed Table'!$A$5:$B$22,2))","v":""},"",{"$f":"IF(F16=\"\",\"--\",IFERROR(IF(C16=0,\"\",'Multiple Sire Hidden'!$A15+F16),\"--\"))","v":"--"},null,{"$f":"IF(H16=\"\",\"--\",IFERROR(IF(C16=0,\"\",H16+'Multiple Sire Hidden'!$B15),\"--\"))","v":"--"},{"$f":"IF(I16=\"\",\"--\",IFERROR(IF(C16=0,\"\",I16+'Multiple Sire Hidden'!$C15),\"--\"))","v":"--"},{"$f":"IF(J16=\"\",\"--\",IFERROR(IF(C16=0,\"\",J16+'Multiple Sire Hidden'!$D15),\"--\"))","v":"--"},{"$f":"IF(K16=\"\",\"--\",IFERROR(IF(C16=0,\"\",K16+'Multiple Sire Hidden'!$E15),\"--\"))","v":"--"},{"$f":"IF(L16=\"\",\"--\",IFERROR(IF(C16=0,\"\",L16+'Multiple Sire Hidden'!$F15),\"--\"))","v":"--"},{"$f":"IF(M16=\"\", \"--\", IFERROR(IF(C16=0,\"\",M16+'Multiple Sire Hidden'!$G15),\"--\"))","v":"--"},{"$f":"IF(N16=\"\",\"--\",IFERROR(IF(C16=0,\"\",N16+'Multiple Sire Hidden'!$H15),\"--\"))","v":"--"}]
["","","",{"$f":"IF(C17=0,\"\",VLOOKUP(C39,'Breed Table'!$A$5:$B$22,2))","v":""},"",{"$f":"IF(F17=\"\",\"--\",IFERROR(IF(C17=0,\"\",'Multiple Sire Hidden'!$A16+F17),\"--\"))","v":"--"},null,{"$f":"IF(H17=\"\",\"--\",IFERROR(IF(C17=0,\"\",H17+'Multiple Sire Hidden'!$B16),\"--\"))","v":"--"},{"$f":"IF(I17=\"\",\"--\",IFERROR(IF(C17=0,\"\",I17+'Multiple Sire Hidden'!$C16),\"--\"))","v":"--"},{"$f":"IF(J17=\"\",\"--\",IFERROR(IF(C17=0,\"\",J17+'Multiple Sire Hidden'!$D16),\"--\"))","v":"--"},{"$f":"IF(K17=\"\",\"--\",IFERROR(IF(C17=0,\"\",K17+'Multiple Sire Hidden'!$E16),\"--\"))","v":"--"},{"$f":"IF(L17=\"\",\"--\",IFERROR(IF(C17=0,\"\",L17+'Multiple Sire Hidden'!$F16),\"--\"))","v":"--"},{"$f":"IF(M17=\"\", \"--\", IFERROR(IF(C17=0,\"\",M17+'Multiple Sire Hidden'!$G16),\"--\"))","v":"--"},{"$f":"IF(N17=\"\",\"--\",IFERROR(IF(C17=0,\"\",N17+'Multiple Sire Hidden'!$H16),\"--\"))","v":"--"}]
["","","",{"$f":"IF(C18=0,\"\",VLOOKUP(C40,'Breed Table'!$A$5:$B$22,2))","v":""},"",{"$f":"IF(F18=\"\",\"--\",IFERROR(IF(C18=0,\"\",'Multiple Sire Hidden'!$A17+F18),\"--\"))","v":"--"},null,{"$f":"IF(H18=\"\",\"--\",IFERROR(IF(C18=0,\"\",H18+'Multiple Sire Hidden'!$B17),\"--\"))","v":"--"},{"$f":"IF(I18=\"\",\"--\",IFERROR(IF(C18=0,\"\",I18+'Multiple Sire Hidden'!$C17),\"--\"))","v":"--"},{"$f":"IF(J18=\"\",\"--\",IFERROR(IF(C18=0,\"\",J18+'Multiple Sire Hidden'!$D17),\"--\"))","v":"--"},{"$f":"IF(K18=\"\",\"--\",IFERROR(IF(C18=0,\"\",K18+'Multiple Sire Hidden'!$E17),\"--\"))","v":"--"},{"$f":"IF(L18=\"\",\"--\",IFERROR(IF(C18=0,\"\",L18+'Multiple Sire Hidden'!$F17),\"--\"))","v":"--"},{"$f":"IF(M18=\"\", \"--\", IFERROR(IF(C18=0,\"\",M18+'Multiple Sire Hidden'!$G17),\"--\"))","v":"--"},{"$f":"IF(N18=\"\",\"--\",IFERROR(IF(C18=0,\"\",N18+'Multiple Sire Hidden'!$H17),\"--\"))","v":"--"}]
["","","",{"$f":"IF(C19=0,\"\",VLOOKUP(C41,'Breed Table'!$A$5:$B$22,2))","v":""},"",{"$f":"IF(F19=\"\",\"--\",IFERROR(IF(C19=0,\"\",'Multiple Sire Hidden'!$A18+F19),\"--\"))","v":"--"},null,{"$f":"IF(H19=\"\",\"--\",IFERROR(IF(C19=0,\"\",H19+'Multiple Sire Hidden'!$B18),\"--\"))","v":"--"},{"$f":"IF(I19=\"\",\"--\",IFERROR(IF(C19=0,\"\",I19+'Multiple Sire Hidden'!$C18),\"--\"))","v":"--"},{"$f":"IF(J19=\"\",\"--\",IFERROR(IF(C19=0,\"\",J19+'Multiple Sire Hidden'!$D18),\"--\"))","v":"--"},{"$f":"IF(K19=\"\",\"--\",IFERROR(IF(C19=0,\"\",K19+'Multiple Sire Hidden'!$E18),\"--\"))","v":"--"},{"$f":"IF(L19=\"\",\"--\",IFERROR(IF(C19=0,\"\",L19+'Multiple Sire Hidden'!$F18),\"--\"))","v":"--"},{"$f":"IF(M19=\"\", \"--\", IFERROR(IF(C19=0,\"\",M19+'Multiple Sire Hidden'!$G18),\"--\"))","v":"--"},{"$f":"IF(N19=\"\",\"--\",IFERROR(IF(C19=0,\"\",N19+'Multiple Sire Hidden'!$H18),\"--\"))","v":"--"}]
["","","",{"$f":"IF(C20=0,\"\",VLOOKUP(C42,'Breed Table'!$A$5:$B$22,2))","v":""},"",{"$f":"IF(F20=\"\",\"--\",IFERROR(IF(C20=0,\"\",'Multiple Sire Hidden'!$A19+F20),\"--\"))","v":"--"},null,{"$f":"IF(H20=\"\",\"--\",IFERROR(IF(C20=0,\"\",H20+'Multiple Sire Hidden'!$B19),\"--\"))","v":"--"},{"$f":"IF(I20=\"\",\"--\",IFERROR(IF(C20=0,\"\",I20+'Multiple Sire Hidden'!$C19),\"--\"))","v":"--"},{"$f":"IF(J20=\"\",\"--\",IFERROR(IF(C20=0,\"\",J20+'Multiple Sire Hidden'!$D19),\"--\"))","v":"--"},{"$f":"IF(K20=\"\",\"--\",IFERROR(IF(C20=0,\"\",K20+'Multiple Sire Hidden'!$E19),\"--\"))","v":"--"},{"$f":"IF(L20=\"\",\"--\",IFERROR(IF(C20=0,\"\",L20+'Multiple Sire Hidden'!$F19),\"--\"))","v":"--"},{"$f":"IF(M20=\"\", \"--\", IFERROR(IF(C20=0,\"\",M20+'Multiple Sire Hidden'!$G19),\"--\"))","v":"--"},{"$f":"IF(N20=\"\",\"--\",IFERROR(IF(C20=0,\"\",N20+'Multiple Sire Hidden'!$H19),\"--\"))","v":"--"}]
["","","",{"$f":"IF(C21=0,\"\",VLOOKUP(C43,'Breed Table'!$A$5:$B$22,2))","v":""},"",{"$f":"IF(F21=\"\",\"--\",IFERROR(IF(C21=0,\"\",'Multiple Sire Hidden'!$A20+F21),\"--\"))","v":"--"},null,{"$f":"IF(H21=\"\",\"--\",IFERROR(IF(C21=0,\"\",H21+'Multiple Sire Hidden'!$B20),\"--\"))","v":"--"},{"$f":"IF(I21=\"\",\"--\",IFERROR(IF(C21=0,\"\",I21+'Multiple Sire Hidden'!$C20),\"--\"))","v":"--"},{"$f":"IF(J21=\"\",\"--\",IFERROR(IF(C21=0,\"\",J21+'Multiple Sire Hidden'!$D20),\"--\"))","v":"--"},{"$f":"IF(K21=\"\",\"--\",IFERROR(IF(C21=0,\"\",K21+'Multiple Sire Hidden'!$E20),\"--\"))","v":"--"},{"$f":"IF(L21=\"\",\"--\",IFERROR(IF(C21=0,\"\",L21+'Multiple Sire Hidden'!$F20),\"--\"))","v":"--"},{"$f":"IF(M21=\"\", \"--\", IFERROR(IF(C21=0,\"\",M21+'Multiple Sire Hidden'!$G20),\"--\"))","v":"--"},{"$f":"IF(N21=\"\",\"--\",IFERROR(IF(C21=0,\"\",N21+'Multiple Sire Hidden'!$H20),\"--\"))","v":"--"}]
["","","",{"$f":"IF(C22=0,\"\",VLOOKUP(C44,'Breed Table'!$A$5:$B$22,2))","v":""},"",{"$f":"IF(F22=\"\",\"--\",IFERROR(IF(C22=0,\"\",'Multiple Sire Hidden'!$A21+F22),\"--\"))","v":"--"},null,{"$f":"IF(H22=\"\",\"--\",IFERROR(IF(C22=0,\"\",H22+'Multiple Sire Hidden'!$B21),\"--\"))","v":"--"},{"$f":"IF(I22=\"\",\"--\",IFERROR(IF(C22=0,\"\",I22+'Multiple Sire Hidden'!$C21),\"--\"))","v":"--"},{"$f":"IF(J22=\"\",\"--\",IFERROR(IF(C22=0,\"\",J22+'Multiple Sire Hidden'!$D21),\"--\"))","v":"--"},{"$f":"IF(K22=\"\",\"--\",IFERROR(IF(C22=0,\"\",K22+'Multiple Sire Hidden'!$E21),\"--\"))","v":"--"},{"$f":"IF(L22=\"\",\"--\",IFERROR(IF(C22=0,\"\",L22+'Multiple Sire Hidden'!$F21),\"--\"))","v":"--"},{"$f":"IF(M22=\"\", \"--\", IFERROR(IF(C22=0,\"\",M22+'Multiple Sire Hidden'!$G21),\"--\"))","v":"--"},{"$f":"IF(N22=\"\",\"--\",IFERROR(IF(C22=0,\"\",N22+'Multiple Sire Hidden'!$H21),\"--\"))","v":"--"}]
["","","",{"$f":"IF(C23=0,\"\",VLOOKUP(C45,'Breed Table'!$A$5:$B$22,2))","v":""},"",{"$f":"IF(F23=\"\",\"--\",IFERROR(IF(C23=0,\"\",'Multiple Sire Hidden'!$A22+F23),\"--\"))","v":"--"},null,{"$f":"IF(H23=\"\",\"--\",IFERROR(IF(C23=0,\"\",H23+'Multiple Sire Hidden'!$B22),\"--\"))","v":"--"},{"$f":"IF(I23=\"\",\"--\",IFERROR(IF(C23=0,\"\",I23+'Multiple Sire Hidden'!$C22),\"--\"))","v":"--"},{"$f":"IF(J23=\"\",\"--\",IFERROR(IF(C23=0,\"\",J23+'Multiple Sire Hidden'!$D22),\"--\"))","v":"--"},{"$f":"IF(K23=\"\",\"--\",IFERROR(IF(C23=0,\"\",K23+'Multiple Sire Hidden'!$E22),\"--\"))","v":"--"},{"$f":"IF(L23=\"\",\"--\",IFERROR(IF(C23=0,\"\",L23+'Multiple Sire Hidden'!$F22),\"--\"))","v":"--"},{"$f":"IF(M23=\"\", \"--\", IFERROR(IF(C23=0,\"\",M23+'Multiple Sire Hidden'!$G22),\"--\"))","v":"--"},{"$f":"IF(N23=\"\",\"--\",IFERROR(IF(C23=0,\"\",N23+'Multiple Sire Hidden'!$H22),\"--\"))","v":"--"}]
["","","",{"$f":"IF(C24=0,\"\",VLOOKUP(C46,'Breed Table'!$A$5:$B$22,2))","v":""},"",{"$f":"IF(F24=\"\",\"--\",IFERROR(IF(C24=0,\"\",'Multiple Sire Hidden'!$A23+F24),\"--\"))","v":"--"},null,{"$f":"IF(H24=\"\",\"--\",IFERROR(IF(C24=0,\"\",H24+'Multiple Sire Hidden'!$B23),\"--\"))","v":"--"},{"$f":"IF(I24=\"\",\"--\",IFERROR(IF(C24=0,\"\",I24+'Multiple Sire Hidden'!$C23),\"--\"))","v":"--"},{"$f":"IF(J24=\"\",\"--\",IFERROR(IF(C24=0,\"\",J24+'Multiple Sire Hidden'!$D23),\"--\"))","v":"--"},{"$f":"IF(K24=\"\",\"--\",IFERROR(IF(C24=0,\"\",K24+'Multiple Sire Hidden'!$E23),\"--\"))","v":"--"},{"$f":"IF(L24=\"\",\"--\",IFERROR(IF(C24=0,\"\",L24+'Multiple Sire Hidden'!$F23),\"--\"))","v":"--"},{"$f":"IF(M24=\"\", \"--\", IFERROR(IF(C24=0,\"\",M24+'Multiple Sire Hidden'!$G23),\"--\"))","v":"--"},{"$f":"IF(N24=\"\",\"--\",IFERROR(IF(C24=0,\"\",N24+'Multiple Sire Hidden'!$H23),\"--\"))","v":"--"}]
[]
[]
[]
[]
[]
["SECTION III:  Generated Across Breed EPD Adjusted to this Breed Basis:",null,null,null,null,null,2]
[null,"Sire ID","Breed Code","Breed",null,"Across-Breed Birth Wt","Across-Breed Adjustment (BW)","Across-Breed Weaning Wt","Across-Breed Yearling Wt","Across-Breed Maternal Milk","*Across-Breed Marbling","*Across-Breed REA","*Across-Breed Fat Thickness","*Across-Breed Carcass Wt"]
[{"$f":"IF(A27=0,\"\",A27)","v":""},{"$f":"IF(B27=0,\"\",B27)","v":"Comrade"},{"$f":"IF(C27=0,\"\",C27)","v":1},{"$f":"IF(D27=0,\"\",D27)","v":"Angus"},"Select Sires",{"$f":"IF(F5=\"\",\"--\",IFERROR(IF(C5=0,\"\",(F5+'Multiple Sire Hidden'!A4)-'Multiple Sire Hidden'!J4),\"--\"))","v":-4.9000000000000004},{"$f":"(VLOOKUP($G$52,'Breed Table'!$A$5:$I$23,3))","v":1.4},{"$f":"IF(H5=\"\",\"--\",IFERROR(IF(C5=0,\"\",(H5+'Multiple Sire Hidden'!B4)-'Multiple Sire Hidden'!K4),\"--\"))","v":62.5},{"$f":"IF(I5=\"\",\"--\",IFERROR(IF(C5=0,\"\",(I5+'Multiple Sire Hidden'!C4)-'Multiple Sire Hidden'!L4),\"--\"))","v":134.4},{"$f":"IF(J5=\"\",\"--\",IFERROR(IF(C5=0,\"\",(J5+'Multiple Sire Hidden'!D4)-'Multiple Sire Hidden'!M4),\"--\"))","v":39.5},{"$f":"IF(K5=\"\",\"--\",IFERROR(IF(C5=0,\"\",(K5+'Multiple Sire Hidden'!E4)-'Multiple Sire Hidden'!N4),\"--\"))","v":0.86999999999999988},{"$f":"IF(L5=\"\",\"--\",IFERROR(IF(C5=0,\"\",(L5+'Multiple Sire Hidden'!F4)-'Multiple Sire Hidden'!O4),\"--\"))","v":0.55999999999999994},{"$f":"IF(M5=\"\",\"--\",IFERROR(IF(C5=0,\"\",(M5+'Multiple Sire Hidden'!G4)-'Multiple Sire Hidden'!P4),\"--\"))","v":6.8999999999999992E-2},{"$f":"IF(N5=\"\",\"--\",IFERROR(IF(C5=0,\"\",(N5+'Multiple Sire Hidden'!H4)-'Multiple Sire Hidden'!Q4),\"--\"))","v":58.1}]
[{"$f":"IF(A28=0,\"\",A28)","v":""},"Liberty",3,"Red Angus","Select Sires",{"$f":"IF(F6=\"\",\"--\",IFERROR(IF(C6=0,\"\",(F6+'Multiple Sire Hidden'!A5)-'Multiple Sire Hidden'!J5),\"--\"))","v":-4.2},null,{"$f":"IF(H6=\"\",\"--\",IFERROR(IF(C6=0,\"\",(H6+'Multiple Sire Hidden'!B5)-'Multiple Sire Hidden'!K5),\"--\"))","v":62.1},{"$f":"IF(I6=\"\",\"--\",IFERROR(IF(C6=0,\"\",(I6+'Multiple Sire Hidden'!C5)-'Multiple Sire Hidden'!L5),\"--\"))","v":121},{"$f":"IF(J6=\"\",\"--\",IFERROR(IF(C6=0,\"\",(J6+'Multiple Sire Hidden'!D5)-'Multiple Sire Hidden'!M5),\"--\"))","v":38},{"$f":"IF(K6=\"\",\"--\",IFERROR(IF(C6=0,\"\",(K6+'Multiple Sire Hidden'!E5)-'Multiple Sire Hidden'!N5),\"--\"))","v":0.77},{"$f":"IF(L6=\"\",\"--\",IFERROR(IF(C6=0,\"\",(L6+'Multiple Sire Hidden'!F5)-'Multiple Sire Hidden'!O5),\"--\"))","v":0.56000000000000005},{"$f":"IF(M6=\"\",\"--\",IFERROR(IF(C6=0,\"\",(M6+'Multiple Sire Hidden'!G5)-'Multiple Sire Hidden'!P5),\"--\"))","v":1.2999999999999998E-2},{"$f":"IF(N6=\"\",\"--\",IFERROR(IF(C6=0,\"\",(N6+'Multiple Sire Hidden'!H5)-'Multiple Sire Hidden'!Q5),\"--\"))","v":54.900000000000006}]
["","In Force",17,"Simmental","Select Sires",{"$f":"IF(F7=\"\",\"--\",IFERROR(IF(C7=0,\"\",(F7+'Multiple Sire Hidden'!A6)-'Multiple Sire Hidden'!J6),\"--\"))","v":-2.1},{"$f":"(VLOOKUP($G$52,'Breed Table'!$A$5:$I$23,3))","v":1.4},{"$f":"IF(H7=\"\",\"--\",IFERROR(IF(C7=0,\"\",(H7+'Multiple Sire Hidden'!B6)-'Multiple Sire Hidden'!K6),\"--\"))","v":54.699999999999996},{"$f":"IF(I7=\"\",\"--\",IFERROR(IF(C7=0,\"\",(I7+'Multiple Sire Hidden'!C6)-'Multiple Sire Hidden'!L6),\"--\"))","v":97.1},{"$f":"IF(J7=\"\",\"--\",IFERROR(IF(C7=0,\"\",(J7+'Multiple Sire Hidden'!D6)-'Multiple Sire Hidden'!M6),\"--\"))","v":47.5},{"$f":"IF(K7=\"\",\"--\",IFERROR(IF(C7=0,\"\",(K7+'Multiple Sire Hidden'!E6)-'Multiple Sire Hidden'!N6),\"--\"))","v":0.85000000000000009},{"$f":"IF(L7=\"\",\"--\",IFERROR(IF(C7=0,\"\",(L7+'Multiple Sire Hidden'!F6)-'Multiple Sire Hidden'!O6),\"--\"))","v":0.90999999999999992},{"$f":"IF(M7=\"\",\"--\",IFERROR(IF(C7=0,\"\",(M7+'Multiple Sire Hidden'!G6)-'Multiple Sire Hidden'!P6),\"--\"))","v":-4.6000000000000013E-2},{"$f":"IF(N7=\"\",\"--\",IFERROR(IF(C7=0,\"\",(N7+'Multiple Sire Hidden'!H6)-'Multiple Sire Hidden'!Q6),\"--\"))","v":36.9}]
["","Sensation",2,"Hereford","Select Sires",{"$f":"IF(F8=\"\",\"--\",IFERROR(IF(C8=0,\"\",(F8+'Multiple Sire Hidden'!A7)-'Multiple Sire Hidden'!J7),\"--\"))","v":-1.1000000000000001},{"$f":"(VLOOKUP($G$52,'Breed Table'!$A$5:$I$23,3))","v":1.4},{"$f":"IF(H8=\"\",\"--\",IFERROR(IF(C8=0,\"\",(H8+'Multiple Sire Hidden'!B7)-'Multiple Sire Hidden'!K7),\"--\"))","v":53},{"$f":"IF(I8=\"\",\"--\",IFERROR(IF(C8=0,\"\",(I8+'Multiple Sire Hidden'!C7)-'Multiple Sire Hidden'!L7),\"--\"))","v":80},{"$f":"IF(J8=\"\",\"--\",IFERROR(IF(C8=0,\"\",(J8+'Multiple Sire Hidden'!D7)-'Multiple Sire Hidden'!M7),\"--\"))","v":39},{"$f":"IF(K8=\"\",\"--\",IFERROR(IF(C8=0,\"\",(K8+'Multiple Sire Hidden'!E7)-'Multiple Sire Hidden'!N7),\"--\"))","v":0.16},{"$f":"IF(L8=\"\",\"--\",IFERROR(IF(C8=0,\"\",(L8+'Multiple Sire Hidden'!F7)-'Multiple Sire Hidden'!O7),\"--\"))","v":0.7},{"$f":"IF(M8=\"\",\"--\",IFERROR(IF(C8=0,\"\",(M8+'Multiple Sire Hidden'!G7)-'Multiple Sire Hidden'!P7),\"--\"))","v":-2.5000000000000008E-2},{"$f":"IF(N8=\"\",\"--\",IFERROR(IF(C8=0,\"\",(N8+'Multiple Sire Hidden'!H7)-'Multiple Sire Hidden'!Q7),\"--\"))","v":73}]
["","","","","",{"$f":"IF(F9=\"\",\"--\",IFERROR(IF(C9=0,\"\",(F9+'Multiple Sire Hidden'!A8)-'Multiple Sire Hidden'!J8),\"--\"))","v":"--"},{"$f":"(VLOOKUP($G$52,'Breed Table'!$A$5:$I$23,3))","v":1.4},{"$f":"IF(H9=\"\",\"--\",IFERROR(IF(C9=0,\"\",(H9+'Multiple Sire Hidden'!B8)-'Multiple Sire Hidden'!K8),\"--\"))","v":"--"},{"$f":"IF(I9=\"\",\"--\",IFERROR(IF(C9=0,\"\",(I9+'Multiple Sire Hidden'!C8)-'Multiple Sire Hidden'!L8),\"--\"))","v":"--"},{"$f":"IF(J9=\"\",\"--\",IFERROR(IF(C9=0,\"\",(J9+'Multiple Sire Hidden'!D8)-'Multiple Sire Hidden'!M8),\"--\"))","v":"--"},{"$f":"IF(K9=\"\",\"--\",IFERROR(IF(C9=0,\"\",(K9+'Multiple Sire Hidden'!E8)-'Multiple Sire Hidden'!N8),\"--\"))","v":"--"},{"$f":"IF(L9=\"\",\"--\",IFERROR(IF(C9=0,\"\",(L9+'Multiple Sire Hidden'!F8)-'Multiple Sire Hidden'!O8),\"--\"))","v":"--"},{"$f":"IF(M9=\"\",\"--\",IFERROR(IF(C9=0,\"\",(M9+'Multiple Sire Hidden'!G8)-'Multiple Sire Hidden'!P8),\"--\"))","v":"--"},{"$f":"IF(N9=\"\",\"--\",IFERROR(IF(C9=0,\"\",(N9+'Multiple Sire Hidden'!H8)-'Multiple Sire Hidden'!Q8),\"--\"))","v":"--"}]
["","","","","",{"$f":"IF(F10=\"\",\"--\",IFERROR(IF(C10=0,\"\",(F10+'Multiple Sire Hidden'!A9)-'Multiple Sire Hidden'!J9),\"--\"))","v":"--"},{"$f":"(VLOOKUP($G$52,'Breed Table'!$A$5:$I$23,3))","v":1.4},{"$f":"IF(H10=\"\",\"--\",IFERROR(IF(C10=0,\"\",(H10+'Multiple Sire Hidden'!B9)-'Multiple Sire Hidden'!K9),\"--\"))","v":"--"},{"$f":"IF(I10=\"\",\"--\",IFERROR(IF(C10=0,\"\",(I10+'Multiple Sire Hidden'!C9)-'Multiple Sire Hidden'!L9),\"--\"))","v":"--"},{"$f":"IF(J10=\"\",\"--\",IFERROR(IF(C10=0,\"\",(J10+'Multiple Sire Hidden'!D9)-'Multiple Sire Hidden'!M9),\"--\"))","v":"--"},{"$f":"IF(K10=\"\",\"--\",IFERROR(IF(C10=0,\"\",(K10+'Multiple Sire Hidden'!E9)-'Multiple Sire Hidden'!N9),\"--\"))","v":"--"},{"$f":"IF(L10=\"\",\"--\",IFERROR(IF(C10=0,\"\",(L10+'Multiple Sire Hidden'!F9)-'Multiple Sire Hidden'!O9),\"--\"))","v":"--"},{"$f":"IF(M10=\"\",\"--\",IFERROR(IF(C10=0,\"\",(M10+'Multiple Sire Hidden'!G9)-'Multiple Sire Hidden'!P9),\"--\"))","v":"--"},{"$f":"IF(N10=\"\",\"--\",IFERROR(IF(C10=0,\"\",(N10+'Multiple Sire Hidden'!H9)-'Multiple Sire Hidden'!Q9),\"--\"))","v":"--"}]
["","","","","",{"$f":"IF(F11=\"\",\"--\",IFERROR(IF(C11=0,\"\",(F11+'Multiple Sire Hidden'!A10)-'Multiple Sire Hidden'!J10),\"--\"))","v":"--"},{"$f":"(VLOOKUP($G$52,'Breed Table'!$A$5:$I$23,3))","v":1.4},{"$f":"IF(H11=\"\",\"--\",IFERROR(IF(C11=0,\"\",(H11+'Multiple Sire Hidden'!B10)-'Multiple Sire Hidden'!K10),\"--\"))","v":"--"},{"$f":"IF(I11=\"\",\"--\",IFERROR(IF(C11=0,\"\",(I11+'Multiple Sire Hidden'!C10)-'Multiple Sire Hidden'!L10),\"--\"))","v":"--"},{"$f":"IF(J11=\"\",\"--\",IFERROR(IF(C11=0,\"\",(J11+'Multiple Sire Hidden'!D10)-'Multiple Sire Hidden'!M10),\"--\"))","v":"--"},{"$f":"IF(K11=\"\",\"--\",IFERROR(IF(C11=0,\"\",(K11+'Multiple Sire Hidden'!E10)-'Multiple Sire Hidden'!N10),\"--\"))","v":"--"},{"$f":"IF(L11=\"\",\"--\",IFERROR(IF(C11=0,\"\",(L11+'Multiple Sire Hidden'!F10)-'Multiple Sire Hidden'!O10),\"--\"))","v":"--"},{"$f":"IF(M11=\"\",\"--\",IFERROR(IF(C11=0,\"\",(M11+'Multiple Sire Hidden'!G10)-'Multiple Sire Hidden'!P10),\"--\"))","v":"--"},{"$f":"IF(N11=\"\",\"--\",IFERROR(IF(C11=0,\"\",(N11+'Multiple Sire Hidden'!H10)-'Multiple Sire Hidden'!Q10),\"--\"))","v":"--"}]
["","","","","",{"$f":"IF(F12=\"\",\"--\",IFERROR(IF(C12=0,\"\",(F12+'Multiple Sire Hidden'!A11)-'Multiple Sire Hidden'!J11),\"--\"))","v":"--"},{"$f":"(VLOOKUP($G$52,'Breed Table'!$A$5:$I$23,3))","v":1.4},{"$f":"IF(H12=\"\",\"--\",IFERROR(IF(C12=0,\"\",(H12+'Multiple Sire Hidden'!B11)-'Multiple Sire Hidden'!K11),\"--\"))","v":"--"},{"$f":"IF(I12=\"\",\"--\",IFERROR(IF(C12=0,\"\",(I12+'Multiple Sire Hidden'!C11)-'Multiple Sire Hidden'!L11),\"--\"))","v":"--"},{"$f":"IF(J12=\"\",\"--\",IFERROR(IF(C12=0,\"\",(J12+'Multiple Sire Hidden'!D11)-'Multiple Sire Hidden'!M11),\"--\"))","v":"--"},{"$f":"IF(K12=\"\",\"--\",IFERROR(IF(C12=0,\"\",(K12+'Multiple Sire Hidden'!E11)-'Multiple Sire Hidden'!N11),\"--\"))","v":"--"},{"$f":"IF(L12=\"\",\"--\",IFERROR(IF(C12=0,\"\",(L12+'Multiple Sire Hidden'!F11)-'Multiple Sire Hidden'!O11),\"--\"))","v":"--"},{"$f":"IF(M12=\"\",\"--\",IFERROR(IF(C12=0,\"\",(M12+'Multiple Sire Hidden'!G11)-'Multiple Sire Hidden'!P11),\"--\"))","v":"--"},{"$f":"IF(N12=\"\",\"--\",IFERROR(IF(C12=0,\"\",(N12+'Multiple Sire Hidden'!H11)-'Multiple Sire Hidden'!Q11),\"--\"))","v":"--"}]
["","","","","",{"$f":"IF(F13=\"\",\"--\",IFERROR(IF(C13=0,\"\",(F13+'Multiple Sire Hidden'!A12)-'Multiple Sire Hidden'!J12),\"--\"))","v":"--"},{"$f":"(VLOOKUP($G$52,'Breed Table'!$A$5:$I$23,3))","v":1.4},{"$f":"IF(H13=\"\",\"--\",IFERROR(IF(C13=0,\"\",(H13+'Multiple Sire Hidden'!B12)-'Multiple Sire Hidden'!K12),\"--\"))","v":"--"},{"$f":"IF(I13=\"\",\"--\",IFERROR(IF(C13=0,\"\",(I13+'Multiple Sire Hidden'!C12)-'Multiple Sire Hidden'!L12),\"--\"))","v":"--"},{"$f":"IF(J13=\"\",\"--\",IFERROR(IF(C13=0,\"\",(J13+'Multiple Sire Hidden'!D12)-'Multiple Sire Hidden'!M12),\"--\"))","v":"--"},{"$f":"IF(K13=\"\",\"--\",IFERROR(IF(C13=0,\"\",(K13+'Multiple Sire Hidden'!E12)-'Multiple Sire Hidden'!N12),\"--\"))","v":"--"},{"$f":"IF(L13=\"\",\"--\",IFERROR(IF(C13=0,\"\",(L13+'Multiple Sire Hidden'!F12)-'Multiple Sire Hidden'!O12),\"--\"))","v":"--"},{"$f":"IF(M13=\"\",\"--\",IFERROR(IF(C13=0,\"\",(M13+'Multiple Sire Hidden'!G12)-'Multiple Sire Hidden'!P12),\"--\"))","v":"--"},{"$f":"IF(N13=\"\",\"--\",IFERROR(IF(C13=0,\"\",(N13+'Multiple Sire Hidden'!H12)-'Multiple Sire Hidden'!Q12),\"--\"))","v":"--"}]
["","","","","",{"$f":"IF(F14=\"\",\"--\",IFERROR(IF(C14=0,\"\",(F14+'Multiple Sire Hidden'!A13)-'Multiple Sire Hidden'!J13),\"--\"))","v":"--"},{"$f":"(VLOOKUP($G$52,'Breed Table'!$A$5:$I$23,3))","v":1.4},{"$f":"IF(H14=\"\",\"--\",IFERROR(IF(C14=0,\"\",(H14+'Multiple Sire Hidden'!B13)-'Multiple Sire Hidden'!K13),\"--\"))","v":"--"},{"$f":"IF(I14=\"\",\"--\",IFERROR(IF(C14=0,\"\",(I14+'Multiple Sire Hidden'!C13)-'Multiple Sire Hidden'!L13),\"--\"))","v":"--"},{"$f":"IF(J14=\"\",\"--\",IFERROR(IF(C14=0,\"\",(J14+'Multiple Sire Hidden'!D13)-'Multiple Sire Hidden'!M13),\"--\"))","v":"--"},{"$f":"IF(K14=\"\",\"--\",IFERROR(IF(C14=0,\"\",(K14+'Multiple Sire Hidden'!E13)-'Multiple Sire Hidden'!N13),\"--\"))","v":"--"},{"$f":"IF(L14=\"\",\"--\",IFERROR(IF(C14=0,\"\",(L14+'Multiple Sire Hidden'!F13)-'Multiple Sire Hidden'!O13),\"--\"))","v":"--"},{"$f":"IF(M14=\"\",\"--\",IFERROR(IF(C14=0,\"\",(M14+'Multiple Sire Hidden'!G13)-'Multiple Sire Hidden'!P13),\"--\"))","v":"--"},{"$f":"IF(N14=\"\",\"--\",IFERROR(IF(C14=0,\"\",(N14+'Multiple Sire Hidden'!H13)-'Multiple Sire Hidden'!Q13),\"--\"))","v":"--"}]
["","","","","",{"$f":"IF(F15=\"\",\"--\",IFERROR(IF(C15=0,\"\",(F15+'Multiple Sire Hidden'!A14)-'Multiple Sire Hidden'!J14),\"--\"))","v":"--"},{"$f":"(VLOOKUP($G$52,'Breed Table'!$A$5:$I$23,3))","v":1.4},{"$f":"IF(H15=\"\",\"--\",IFERROR(IF(C15=0,\"\",(H15+'Multiple Sire Hidden'!B14)-'Multiple Sire Hidden'!K14),\"--\"))","v":"--"},{"$f":"IF(I15=\"\",\"--\",IFERROR(IF(C15=0,\"\",(I15+'Multiple Sire Hidden'!C14)-'Multiple Sire Hidden'!L14),\"--\"))","v":"--"},{"$f":"IF(J15=\"\",\"--\",IFERROR(IF(C15=0,\"\",(J15+'Multiple Sire Hidden'!D14)-'Multiple Sire Hidden'!M14),\"--\"))","v":"--"},{"$f":"IF(K15=\"\",\"--\",IFERROR(IF(C15=0,\"\",(K15+'Multiple Sire Hidden'!E14)-'Multiple Sire Hidden'!N14),\"--\"))","v":"--"},{"$f":"IF(L15=\"\",\"--\",IFERROR(IF(C15=0,\"\",(L15+'Multiple Sire Hidden'!F14)-'Multiple Sire Hidden'!O14),\"--\"))","v":"--"},{"$f":"IF(M15=\"\",\"--\",IFERROR(IF(C15=0,\"\",(M15+'Multiple Sire Hidden'!G14)-'Multiple Sire Hidden'!P14),\"--\"))","v":"--"},{"$f":"IF(N15=\"\",\"--\",IFERROR(IF(C15=0,\"\",(N15+'Multiple Sire Hidden'!H14)-'Multiple Sire Hidden'!Q14),\"--\"))","v":"--"}]
["","","","","",{"$f":"IF(F16=\"\",\"--\",IFERROR(IF(C16=0,\"\",(F16+'Multiple Sire Hidden'!A15)-'Multiple Sire Hidden'!J15),\"--\"))","v":"--"},{"$f":"(VLOOKUP($G$52,'Breed Table'!$A$5:$I$23,3))","v":1.4},{"$f":"IF(H16=\"\",\"--\",IFERROR(IF(C16=0,\"\",(H16+'Multiple Sire Hidden'!B15)-'Multiple Sire Hidden'!K15),\"--\"))","v":"--"},{"$f":"IF(I16=\"\",\"--\",IFERROR(IF(C16=0,\"\",(I16+'Multiple Sire Hidden'!C15)-'Multiple Sire Hidden'!L15),\"--\"))","v":"--"},{"$f":"IF(J16=\"\",\"--\",IFERROR(IF(C16=0,\"\",(J16+'Multiple Sire Hidden'!D15)-'Multiple Sire Hidden'!M15),\"--\"))","v":"--"},{"$f":"IF(K16=\"\",\"--\",IFERROR(IF(C16=0,\"\",(K16+'Multiple Sire Hidden'!E15)-'Multiple Sire Hidden'!N15),\"--\"))","v":"--"},{"$f":"IF(L16=\"\",\"--\",IFERROR(IF(C16=0,\"\",(L16+'Multiple Sire Hidden'!F15)-'Multiple Sire Hidden'!O15),\"--\"))","v":"--"},{"$f":"IF(M16=\"\",\"--\",IFERROR(IF(C16=0,\"\",(M16+'Multiple Sire Hidden'!G15)-'Multiple Sire Hidden'!P15),\"--\"))","v":"--"},{"$f":"IF(N16=\"\",\"--\",IFERROR(IF(C16=0,\"\",(N16+'Multiple Sire Hidden'!H15)-'Multiple Sire Hidden'!Q15),\"--\"))","v":"--"}]
["","","","","",{"$f":"IF(F17=\"\",\"--\",IFERROR(IF(C17=0,\"\",(F17+'Multiple Sire Hidden'!A16)-'Multiple Sire Hidden'!J16),\"--\"))","v":"--"},{"$f":"(VLOOKUP($G$52,'Breed Table'!$A$5:$I$23,3))","v":1.4},{"$f":"IF(H17=\"\",\"--\",IFERROR(IF(C17=0,\"\",(H17+'Multiple Sire Hidden'!B16)-'Multiple Sire Hidden'!K16),\"--\"))","v":"--"},{"$f":"IF(I17=\"\",\"--\",IFERROR(IF(C17=0,\"\",(I17+'Multiple Sire Hidden'!C16)-'Multiple Sire Hidden'!L16),\"--\"))","v":"--"},{"$f":"IF(J17=\"\",\"--\",IFERROR(IF(C17=0,\"\",(J17+'Multiple Sire Hidden'!D16)-'Multiple Sire Hidden'!M16),\"--\"))","v":"--"},{"$f":"IF(K17=\"\",\"--\",IFERROR(IF(C17=0,\"\",(K17+'Multiple Sire Hidden'!E16)-'Multiple Sire Hidden'!N16),\"--\"))","v":"--"},{"$f":"IF(L17=\"\",\"--\",IFERROR(IF(C17=0,\"\",(L17+'Multiple Sire Hidden'!F16)-'Multiple Sire Hidden'!O16),\"--\"))","v":"--"},{"$f":"IF(M17=\"\",\"--\",IFERROR(IF(C17=0,\"\",(M17+'Multiple Sire Hidden'!G16)-'Multiple Sire Hidden'!P16),\"--\"))","v":"--"},{"$f":"IF(N17=\"\",\"--\",IFERROR(IF(C17=0,\"\",(N17+'Multiple Sire Hidden'!H16)-'Multiple Sire Hidden'!Q16),\"--\"))","v":"--"}]
["","","","","",{"$f":"IF(F18=\"\",\"--\",IFERROR(IF(C18=0,\"\",(F18+'Multiple Sire Hidden'!A17)-'Multiple Sire Hidden'!J17),\"--\"))","v":"--"},{"$f":"(VLOOKUP($G$52,'Breed Table'!$A$5:$I$23,3))","v":1.4},{"$f":"IF(H18=\"\",\"--\",IFERROR(IF(C18=0,\"\",(H18+'Multiple Sire Hidden'!B17)-'Multiple Sire Hidden'!K17),\"--\"))","v":"--"},{"$f":"IF(I18=\"\",\"--\",IFERROR(IF(C18=0,\"\",(I18+'Multiple Sire Hidden'!C17)-'Multiple Sire Hidden'!L17),\"--\"))","v":"--"},{"$f":"IF(J18=\"\",\"--\",IFERROR(IF(C18=0,\"\",(J18+'Multiple Sire Hidden'!D17)-'Multiple Sire Hidden'!M17),\"--\"))","v":"--"},{"$f":"IF(K18=\"\",\"--\",IFERROR(IF(C18=0,\"\",(K18+'Multiple Sire Hidden'!E17)-'Multiple Sire Hidden'!N17),\"--\"))","v":"--"},{"$f":"IF(L18=\"\",\"--\",IFERROR(IF(C18=0,\"\",(L18+'Multiple Sire Hidden'!F17)-'Multiple Sire Hidden'!O17),\"--\"))","v":"--"},{"$f":"IF(M18=\"\",\"--\",IFERROR(IF(C18=0,\"\",(M18+'Multiple Sire Hidden'!G17)-'Multiple Sire Hidden'!P17),\"--\"))","v":"--"},{"$f":"IF(N18=\"\",\"--\",IFERROR(IF(C18=0,\"\",(N18+'Multiple Sire Hidden'!H17)-'Multiple Sire Hidden'!Q17),\"--\"))","v":"--"}]
["","","","","",{"$f":"IF(F19=\"\",\"--\",IFERROR(IF(C19=0,\"\",(F19+'Multiple Sire Hidden'!A18)-'Multiple Sire Hidden'!J18),\"--\"))","v":"--"},{"$f":"(VLOOKUP($G$52,'Breed Table'!$A$5:$I$23,3))","v":1.4},{"$f":"IF(H19=\"\",\"--\",IFERROR(IF(C19=0,\"\",(H19+'Multiple Sire Hidden'!B18)-'Multiple Sire Hidden'!K18),\"--\"))","v":"--"},{"$f":"IF(I19=\"\",\"--\",IFERROR(IF(C19=0,\"\",(I19+'Multiple Sire Hidden'!C18)-'Multiple Sire Hidden'!L18),\"--\"))","v":"--"},{"$f":"IF(J19=\"\",\"--\",IFERROR(IF(C19=0,\"\",(J19+'Multiple Sire Hidden'!D18)-'Multiple Sire Hidden'!M18),\"--\"))","v":"--"},{"$f":"IF(K19=\"\",\"--\",IFERROR(IF(C19=0,\"\",(K19+'Multiple Sire Hidden'!E18)-'Multiple Sire Hidden'!N18),\"--\"))","v":"--"},{"$f":"IF(L19=\"\",\"--\",IFERROR(IF(C19=0,\"\",(L19+'Multiple Sire Hidden'!F18)-'Multiple Sire Hidden'!O18),\"--\"))","v":"--"},{"$f":"IF(M19=\"\",\"--\",IFERROR(IF(C19=0,\"\",(M19+'Multiple Sire Hidden'!G18)-'Multiple Sire Hidden'!P18),\"--\"))","v":"--"},{"$f":"IF(N19=\"\",\"--\",IFERROR(IF(C19=0,\"\",(N19+'Multiple Sire Hidden'!H18)-'Multiple Sire Hidden'!Q18),\"--\"))","v":"--"}]
["","","","","",{"$f":"IF(F20=\"\",\"--\",IFERROR(IF(C20=0,\"\",(F20+'Multiple Sire Hidden'!A19)-'Multiple Sire Hidden'!J19),\"--\"))","v":"--"},{"$f":"(VLOOKUP($G$52,'Breed Table'!$A$5:$I$23,3))","v":1.4},{"$f":"IF(H20=\"\",\"--\",IFERROR(IF(C20=0,\"\",(H20+'Multiple Sire Hidden'!B19)-'Multiple Sire Hidden'!K19),\"--\"))","v":"--"},{"$f":"IF(I20=\"\",\"--\",IFERROR(IF(C20=0,\"\",(I20+'Multiple Sire Hidden'!C19)-'Multiple Sire Hidden'!L19),\"--\"))","v":"--"},{"$f":"IF(J20=\"\",\"--\",IFERROR(IF(C20=0,\"\",(J20+'Multiple Sire Hidden'!D19)-'Multiple Sire Hidden'!M19),\"--\"))","v":"--"},{"$f":"IF(K20=\"\",\"--\",IFERROR(IF(C20=0,\"\",(K20+'Multiple Sire Hidden'!E19)-'Multiple Sire Hidden'!N19),\"--\"))","v":"--"},{"$f":"IF(L20=\"\",\"--\",IFERROR(IF(C20=0,\"\",(L20+'Multiple Sire Hidden'!F19)-'Multiple Sire Hidden'!O19),\"--\"))","v":"--"},{"$f":"IF(M20=\"\",\"--\",IFERROR(IF(C20=0,\"\",(M20+'Multiple Sire Hidden'!G19)-'Multiple Sire Hidden'!P19),\"--\"))","v":"--"},{"$f":"IF(N20=\"\",\"--\",IFERROR(IF(C20=0,\"\",(N20+'Multiple Sire Hidden'!H19)-'Multiple Sire Hidden'!Q19),\"--\"))","v":"--"}]
["","","","","",{"$f":"IF(F21=\"\",\"--\",IFERROR(IF(C21=0,\"\",(F21+'Multiple Sire Hidden'!A20)-'Multiple Sire Hidden'!J20),\"--\"))","v":"--"},{"$f":"(VLOOKUP($G$52,'Breed Table'!$A$5:$I$23,3))","v":1.4},{"$f":"IF(H21=\"\",\"--\",IFERROR(IF(C21=0,\"\",(H21+'Multiple Sire Hidden'!B20)-'Multiple Sire Hidden'!K20),\"--\"))","v":"--"},{"$f":"IF(I21=\"\",\"--\",IFERROR(IF(C21=0,\"\",(I21+'Multiple Sire Hidden'!C20)-'Multiple Sire Hidden'!L20),\"--\"))","v":"--"},{"$f":"IF(J21=\"\",\"--\",IFERROR(IF(C21=0,\"\",(J21+'Multiple Sire Hidden'!D20)-'Multiple Sire Hidden'!M20),\"--\"))","v":"--"},{"$f":"IF(K21=\"\",\"--\",IFERROR(IF(C21=0,\"\",(K21+'Multiple Sire Hidden'!E20)-'Multiple Sire Hidden'!N20),\"--\"))","v":"--"},{"$f":"IF(L21=\"\",\"--\",IFERROR(IF(C21=0,\"\",(L21+'Multiple Sire Hidden'!F20)-'Multiple Sire Hidden'!O20),\"--\"))","v":"--"},{"$f":"IF(M21=\"\",\"--\",IFERROR(IF(C21=0,\"\",(M21+'Multiple Sire Hidden'!G20)-'Multiple Sire Hidden'!P20),\"--\"))","v":"--"},{"$f":"IF(N21=\"\",\"--\",IFERROR(IF(C21=0,\"\",(N21+'Multiple Sire Hidden'!H20)-'Multiple Sire Hidden'!Q20),\"--\"))","v":"--"}]
["","","","","",{"$f":"IF(F22=\"\",\"--\",IFERROR(IF(C22=0,\"\",(F22+'Multiple Sire Hidden'!A21)-'Multiple Sire Hidden'!J21),\"--\"))","v":"--"},{"$f":"(VLOOKUP($G$52,'Breed Table'!$A$5:$I$23,3))","v":1.4},{"$f":"IF(H22=\"\",\"--\",IFERROR(IF(C22=0,\"\",(H22+'Multiple Sire Hidden'!B21)-'Multiple Sire Hidden'!K21),\"--\"))","v":"--"},{"$f":"IF(I22=\"\",\"--\",IFERROR(IF(C22=0,\"\",(I22+'Multiple Sire Hidden'!C21)-'Multiple Sire Hidden'!L21),\"--\"))","v":"--"},{"$f":"IF(J22=\"\",\"--\",IFERROR(IF(C22=0,\"\",(J22+'Multiple Sire Hidden'!D21)-'Multiple Sire Hidden'!M21),\"--\"))","v":"--"},{"$f":"IF(K22=\"\",\"--\",IFERROR(IF(C22=0,\"\",(K22+'Multiple Sire Hidden'!E21)-'Multiple Sire Hidden'!N21),\"--\"))","v":"--"},{"$f":"IF(L22=\"\",\"--\",IFERROR(IF(C22=0,\"\",(L22+'Multiple Sire Hidden'!F21)-'Multiple Sire Hidden'!O21),\"--\"))","v":"--"},{"$f":"IF(M22=\"\",\"--\",IFERROR(IF(C22=0,\"\",(M22+'Multiple Sire Hidden'!G21)-'Multiple Sire Hidden'!P21),\"--\"))","v":"--"},{"$f":"IF(N22=\"\",\"--\",IFERROR(IF(C22=0,\"\",(N22+'Multiple Sire Hidden'!H21)-'Multiple Sire Hidden'!Q21),\"--\"))","v":"--"}]
["","","","","",{"$f":"IF(F23=\"\",\"--\",IFERROR(IF(C23=0,\"\",(F23+'Multiple Sire Hidden'!A22)-'Multiple Sire Hidden'!J22),\"--\"))","v":"--"},{"$f":"(VLOOKUP($G$52,'Breed Table'!$A$5:$I$23,3))","v":1.4},{"$f":"IF(H23=\"\",\"--\",IFERROR(IF(C23=0,\"\",(H23+'Multiple Sire Hidden'!B22)-'Multiple Sire Hidden'!K22),\"--\"))","v":"--"},{"$f":"IF(I23=\"\",\"--\",IFERROR(IF(C23=0,\"\",(I23+'Multiple Sire Hidden'!C22)-'Multiple Sire Hidden'!L22),\"--\"))","v":"--"},{"$f":"IF(J23=\"\",\"--\",IFERROR(IF(C23=0,\"\",(J23+'Multiple Sire Hidden'!D22)-'Multiple Sire Hidden'!M22),\"--\"))","v":"--"},{"$f":"IF(K23=\"\",\"--\",IFERROR(IF(C23=0,\"\",(K23+'Multiple Sire Hidden'!E22)-'Multiple Sire Hidden'!N22),\"--\"))","v":"--"},{"$f":"IF(L23=\"\",\"--\",IFERROR(IF(C23=0,\"\",(L23+'Multiple Sire Hidden'!F22)-'Multiple Sire Hidden'!O22),\"--\"))","v":"--"},{"$f":"IF(M23=\"\",\"--\",IFERROR(IF(C23=0,\"\",(M23+'Multiple Sire Hidden'!G22)-'Multiple Sire Hidden'!P22),\"--\"))","v":"--"},{"$f":"IF(N23=\"\",\"--\",IFERROR(IF(C23=0,\"\",(N23+'Multiple Sire Hidden'!H22)-'Multiple Sire Hidden'!Q22),\"--\"))","v":"--"}]
["","","","","",{"$f":"IF(F24=\"\",\"--\",IFERROR(IF(C24=0,\"\",(F24+'Multiple Sire Hidden'!A23)-'Multiple Sire Hidden'!J23),\"--\"))","v":"--"},{"$f":"(VLOOKUP($G$52,'Breed Table'!$A$5:$I$23,3))","v":1.4},{"$f":"IF(H24=\"\",\"--\",IFERROR(IF(C24=0,\"\",(H24+'Multiple Sire Hidden'!B23)-'Multiple Sire Hidden'!K23),\"--\"))","v":"--"},{"$f":"IF(I24=\"\",\"--\",IFERROR(IF(C24=0,\"\",(I24+'Multiple Sire Hidden'!C23)-'Multiple Sire Hidden'!L23),\"--\"))","v":"--"},{"$f":"IF(J24=\"\",\"--\",IFERROR(IF(C24=0,\"\",(J24+'Multiple Sire Hidden'!D23)-'Multiple Sire Hidden'!M23),\"--\"))","v":"--"},{"$f":"IF(K24=\"\",\"--\",IFERROR(IF(C24=0,\"\",(K24+'Multiple Sire Hidden'!E23)-'Multiple Sire Hidden'!N23),\"--\"))","v":"--"},{"$f":"IF(L24=\"\",\"--\",IFERROR(IF(C24=0,\"\",(L24+'Multiple Sire Hidden'!F23)-'Multiple Sire Hidden'!O23),\"--\"))","v":"--"},{"$f":"IF(M24=\"\",\"--\",IFERROR(IF(C24=0,\"\",(M24+'Multiple Sire Hidden'!G23)-'Multiple Sire Hidden'!P23),\"--\"))","v":"--"},{"$f":"IF(N24=\"\",\"--\",IFERROR(IF(C24=0,\"\",(N24+'Multiple Sire Hidden'!H23)-'Multiple Sire Hidden'!Q23),\"--\"))","v":"--"}]

{"sheet":"Multiple Sire Hidden","index":4,"n_rows":23,"n_cols":17,"rows_kept":23,"cut":false,"hidden":true,"merged":[]}
[]
["II",null,null,null,null,null,null,null,null,"III"]
["Across-Breed Adjustment (BW)","Across-Breed Adjustment (WW)","Across-Breed Adjustment (YW)","Across-Breed Adjustment (MM)","Across-Breed Adjustment (Marbling)","Across-Breed Adjustment (REA)","Across-Breed Adjustment (Fat)","Across-Breed Adjustment (CW)",null,"Across-Breed Adjustment (BW)","Across-Breed Adjustment (WW)","Across-Breed Adjustment (YW)","Across-Breed Adjustment (MM)","Across-Breed Adjustment (Marbling)","Across-Breed Adjustment (REA)","Across-Breed Adjustment (Fat)","Across-Breed Adjustment (CW)"]
[{"$f":"VLOOKUP('Compare Mulitple Sires'!C5,'Breed Table'!A$5:J$22,3)","v":0},{"$f":"VLOOKUP('Compare Mulitple Sires'!C5,'Breed Table'!A$5:J$22,4)","v":0},{"$f":"VLOOKUP('Compare Mulitple Sires'!C5,'Breed Table'!A$5:J$22,5)","v":0},{"$f":"VLOOKUP('Compare Mulitple Sires'!C5,'Breed Table'!A$5:J$22,6)","v":0},{"$f":"VLOOKUP('Compare Mulitple Sires'!C5,'Breed Table'!A$5:J$22,7)","v":0},{"$f":"VLOOKUP('Compare Mulitple Sires'!C5,'Breed Table'!A$5:J$22,8)","v":0},{"$f":"VLOOKUP('Compare Mulitple Sires'!C5,'Breed Table'!A$5:J$22,9)","v":0},{"$f":"VLOOKUP('Compare Mulitple Sires'!C5,'Breed Table'!A$5:J$22,10)","v":0},null,{"$f":"VLOOKUP('Compare Mulitple Sires'!$G$52,'Breed Table'!A$5:J$22,3)","v":1.4},{"$f":"VLOOKUP('Compare Mulitple Sires'!$G$52,'Breed Table'!A$5:J$22,4)","v":-16.5},{"$f":"VLOOKUP('Compare Mulitple Sires'!$G$52,'Breed Table'!A$5:J$22,5)","v":-44.4},{"$f":"VLOOKUP('Compare Mulitple Sires'!$G$52,'Breed Table'!A$5:J$22,6)","v":-12.5},{"$f":"VLOOKUP('Compare Mulitple Sires'!$G$52,'Breed Table'!A$5:J$22,7)","v":-0.3},{"$f":"VLOOKUP('Compare Mulitple Sires'!$G$52,'Breed Table'!A$5:J$22,8)","v":0.02},{"$f":"VLOOKUP('Compare Mulitple Sires'!$G$52,'Breed Table'!A$5:J$22,9)","v":-7.2999999999999995E-2},{"$f":"VLOOKUP('Compare Mulitple Sires'!$G$52,'Breed Table'!A$5:J$22,10)","v":-41.1}]
[{"$f":"VLOOKUP('Compare Mulitple Sires'!C6,'Breed Table'!A$5:J$22,3)","v":2.6},{"$f":"VLOOKUP('Compare Mulitple Sires'!C6,'Breed Table'!A$5:J$22,4)","v":-19.399999999999999},{"$f":"VLOOKUP('Compare Mulitple Sires'!C6,'Breed Table'!A$5:J$22,5)","v":-31.4},{"$f":"VLOOKUP('Compare Mulitple Sires'!C6,'Breed Table'!A$5:J$22,6)","v":1.5},{"$f":"VLOOKUP('Compare Mulitple Sires'!C6,'Breed Table'!A$5:J$22,7)","v":-0.03},{"$f":"VLOOKUP('Compare Mulitple Sires'!C6,'Breed Table'!A$5:J$22,8)","v":0.25},{"$f":"VLOOKUP('Compare Mulitple Sires'!C6,'Breed Table'!A$5:J$22,9)","v":-0.04},{"$f":"VLOOKUP('Compare Mulitple Sires'!C6,'Breed Table'!A$5:J$22,10)","v":-13.2},null,{"$f":"VLOOKUP('Compare Mulitple Sires'!$G$52,'Breed Table'!A$5:J$22,3)","v":1.4},{"$f":"VLOOKUP('Compare Mulitple Sires'!$G$52,'Breed Table'!A$5:J$22,4)","v":-16.5},{"$f":"VLOOKUP('Compare Mulitple Sires'!$G$52,'Breed Table'!A$5:J$22,5)","v":-44.4},{"$f":"VLOOKUP('Compare Mulitple Sires'!$G$52,'Breed Table'!A$5:J$22,6)","v":-12.5},{"$f":"VLOOKUP('Compare Mulitple Sires'!$G$52,'Breed Table'!A$5:J$22,7)","v":-0.3},{"$f":"VLOOKUP('Compare Mulitple Sires'!$G$52,'Breed Table'!A$5:J$22,8)","v":0.02},{"$f":"VLOOKUP('Compare Mulitple Sires'!$G$52,'Breed Table'!A$5:J$22,9)","v":-7.2999999999999995E-2},{"$f":"VLOOKUP('Compare Mulitple Sires'!$G$52,'Breed Table'!A$5:J$22,10)","v":-41.1}]
[{"$f":"VLOOKUP('Compare Mulitple Sires'!C7,'Breed Table'!A$5:J$22,3)","v":2.8},{"$f":"VLOOKUP('Compare Mulitple Sires'!C7,'Breed Table'!A$5:J$22,4)","v":-11.6},{"$f":"VLOOKUP('Compare Mulitple Sires'!C7,'Breed Table'!A$5:J$22,5)","v":-19.2},{"$f":"VLOOKUP('Compare Mulitple Sires'!C7,'Breed Table'!A$5:J$22,6)","v":1.8},{"$f":"VLOOKUP('Compare Mulitple Sires'!C7,'Breed Table'!A$5:J$22,7)","v":-0.12},{"$f":"VLOOKUP('Compare Mulitple Sires'!C7,'Breed Table'!A$5:J$22,8)","v":0.45},{"$f":"VLOOKUP('Compare Mulitple Sires'!C7,'Breed Table'!A$5:J$22,9)","v":-4.9000000000000002E-2},{"$f":"VLOOKUP('Compare Mulitple Sires'!C7,'Breed Table'!A$5:J$22,10)","v":-7.5},null,{"$f":"VLOOKUP('Compare Mulitple Sires'!$G$52,'Breed Table'!A$5:J$22,3)","v":1.4},{"$f":"VLOOKUP('Compare Mulitple Sires'!$G$52,'Breed Table'!A$5:J$22,4)","v":-16.5},{"$f":"VLOOKUP('Compare Mulitple Sires'!$G$52,'Breed Table'!A$5:J$22,5)","v":-44.4},{"$f":"VLOOKUP('Compare Mulitple Sires'!$G$52,'Breed Table'!A$5:J$22,6)","v":-12.5},{"$f":"VLOOKUP('Compare Mulitple Sires'!$G$52,'Breed Table'!A$5:J$22,7)","v":-0.3},{"$f":"VLOOKUP('Compare Mulitple Sires'!$G$52,'Breed Table'!A$5:J$22,8)","v":0.02},{"$f":"VLOOKUP('Compare Mulitple Sires'!$G$52,'Breed Table'!A$5:J$22,9)","v":-7.2999999999999995E-2},{"$f":"VLOOKUP('Compare Mulitple Sires'!$G$52,'Breed Table'!A$5:J$22,10)","v":-41.1}]
[{"$f":"VLOOKUP('Compare Mulitple Sires'!C8,'Breed Table'!A$5:J$22,3)","v":1.4},{"$f":"VLOOKUP('Compare Mulitple Sires'!C8,'Breed Table'!A$5:J$22,4)","v":-16.5},{"$f":"VLOOKUP('Compare Mulitple Sires'!C8,'Breed Table'!A$5:J$22,5)","v":-44.4},{"$f":"VLOOKUP('Compare Mulitple Sires'!C8,'Breed Table'!A$5:J$22,6)","v":-12.5},{"$f":"VLOOKUP('Compare Mulitple Sires'!C8,'Breed Table'!A$5:J$22,7)","v":-0.3},{"$f":"VLOOKUP('Compare Mulitple Sires'!C8,'Breed Table'!A$5:J$22,8)","v":0.02},{"$f":"VLOOKUP('Compare Mulitple Sires'!C8,'Breed Table'!A$5:J$22,9)","v":-7.2999999999999995E-2},{"$f":"VLOOKUP('Compare Mulitple Sires'!C8,'Breed Table'!A$5:J$22,10)","v":-41.1},null,{"$f":"VLOOKUP('Compare Mulitple Sires'!$G$52,'Breed Table'!A$5:J$22,3)","v":1.4},{"$f":"VLOOKUP('Compare Mulitple Sires'!$G$52,'Breed Table'!A$5:J$22,4)","v":-16.5},{"$f":"VLOOKUP('Compare Mulitple Sires'!$G$52,'Breed Table'!A$5:J$22,5)","v":-44.4},{"$f":"VLOOKUP('Compare Mulitple Sires'!$G$52,'Breed Table'!A$5:J$22,6)","v":-12.5},{"$f":"VLOOKUP('Compare Mulitple Sires'!$G$52,'Breed Table'!A$5:J$22,7)","v":-0.3},{"$f":"VLOOKUP('Compare Mulitple Sires'!$G$52,'Breed Table'!A$5:J$22,8)","v":0.02},{"$f":"VLOOKUP('Compare Mulitple Sires'!$G$52,'Breed Table'!A$5:J$22,9)","v":-7.2999999999999995E-2},{"$f":"VLOOKUP('Compare Mulitple Sires'!$G$52,'Breed Table'!A$5:J$22,10)","v":-41.1}]
[{"$f":"VLOOKUP('Compare Mulitple Sires'!C9,'Breed Table'!A$5:J$22,3)","v":{"$error":"#N/A"}},{"$f":"VLOOKUP('Compare Mulitple Sires'!C9,'Breed Table'!A$5:J$22,4)","v":{"$error":"#N/A"}},{"$f":"VLOOKUP('Compare Mulitple Sires'!C9,'Breed Table'!A$5:J$22,5)","v":{"$error":"#N/A"}},{"$f":"VLOOKUP('Compare Mulitple Sires'!C9,'Breed Table'!A$5:J$22,6)","v":{"$error":"#N/A"}},{"$f":"VLOOKUP('Compare Mulitple Sires'!C9,'Breed Table'!A$5:J$22,7)","v":{"$error":"#N/A"}},{"$f":"VLOOKUP('Compare Mulitple Sires'!C9,'Breed Table'!A$5:J$22,8)","v":{"$error":"#N/A"}},{"$f":"VLOOKUP('Compare Mulitple Sires'!C9,'Breed Table'!A$5:J$22,9)","v":{"$error":"#N/A"}},{"$f":"VLOOKUP('Compare Mulitple Sires'!C9,'Breed Table'!A$5:J$22,10)","v":{"$error":"#N/A"}},null,{"$f":"VLOOKUP('Compare Mulitple Sires'!$G$52,'Breed Table'!A$5:J$22,3)","v":1.4},{"$f":"VLOOKUP('Compare Mulitple Sires'!$G$52,'Breed Table'!A$5:J$22,4)","v":-16.5},{"$f":"VLOOKUP('Compare Mulitple Sires'!$G$52,'Breed Table'!A$5:J$22,5)","v":-44.4},{"$f":"VLOOKUP('Compare Mulitple Sires'!$G$52,'Breed Table'!A$5:J$22,6)","v":-12.5},{"$f":"VLOOKUP('Compare Mulitple Sires'!$G$52,'Breed Table'!A$5:J$22,7)","v":-0.3},{"$f":"VLOOKUP('Compare Mulitple Sires'!$G$52,'Breed Table'!A$5:J$22,8)","v":0.02},{"$f":"VLOOKUP('Compare Mulitple Sires'!$G$52,'Breed Table'!A$5:J$22,9)","v":-7.2999999999999995E-2},{"$f":"VLOOKUP('Compare Mulitple Sires'!$G$52,'Breed Table'!A$5:J$22,10)","v":-41.1}]
[{"$f":"VLOOKUP('Compare Mulitple Sires'!C10,'Breed Table'!A$5:J$22,3)","v":{"$error":"#N/A"}},{"$f":"VLOOKUP('Compare Mulitple Sires'!C10,'Breed Table'!A$5:J$22,4)","v":{"$error":"#N/A"}},{"$f":"VLOOKUP('Compare Mulitple Sires'!C10,'Breed Table'!A$5:J$22,5)","v":{"$error":"#N/A"}},{"$f":"VLOOKUP('Compare Mulitple Sires'!C10,'Breed Table'!A$5:J$22,6)","v":{"$error":"#N/A"}},{"$f":"VLOOKUP('Compare Mulitple Sires'!C10,'Breed Table'!A$5:J$22,7)","v":{"$error":"#N/A"}},{"$f":"VLOOKUP('Compare Mulitple Sires'!C10,'Breed Table'!A$5:J$22,8)","v":{"$error":"#N/A"}},{"$f":"VLOOKUP('Compare Mulitple Sires'!C10,'Breed Table'!A$5:J$22,9)","v":{"$error":"#N/A"}},{"$f":"VLOOKUP('Compare Mulitple Sires'!C10,'Breed Table'!A$5:J$22,10)","v":{"$error":"#N/A"}},null,{"$f":"VLOOKUP('Compare Mulitple Sires'!$G$52,'Breed Table'!A$5:J$22,3)","v":1.4},{"$f":"VLOOKUP('Compare Mulitple Sires'!$G$52,'Breed Table'!A$5:J$22,4)","v":-16.5},{"$f":"VLOOKUP('Compare Mulitple Sires'!$G$52,'Breed Table'!A$5:J$22,5)","v":-44.4},{"$f":"VLOOKUP('Compare Mulitple Sires'!$G$52,'Breed Table'!A$5:J$22,6)","v":-12.5},{"$f":"VLOOKUP('Compare Mulitple Sires'!$G$52,'Breed Table'!A$5:J$22,7)","v":-0.3},{"$f":"VLOOKUP('Compare Mulitple Sires'!$G$52,'Breed Table'!A$5:J$22,8)","v":0.02},{"$f":"VLOOKUP('Compare Mulitple Sires'!$G$52,'Breed Table'!A$5:J$22,9)","v":-7.2999999999999995E-2},{"$f":"VLOOKUP('Compare Mulitple Sires'!$G$52,'Breed Table'!A$5:J$22,10)","v":-41.1}]
[{"$f":"VLOOKUP('Compare Mulitple Sires'!C11,'Breed Table'!A$5:J$22,3)","v":{"$error":"#N/A"}},{"$f":"VLOOKUP('Compare Mulitple Sires'!C11,'Breed Table'!A$5:J$22,4)","v":{"$error":"#N/A"}},{"$f":"VLOOKUP('Compare Mulitple Sires'!C11,'Breed Table'!A$5:J$22,5)","v":{"$error":"#N/A"}},{"$f":"VLOOKUP('Compare Mulitple Sires'!C11,'Breed Table'!A$5:J$22,6)","v":{"$error":"#N/A"}},{"$f":"VLOOKUP('Compare Mulitple Sires'!C11,'Breed Table'!A$5:J$22,7)","v":{"$error":"#N/A"}},{"$f":"VLOOKUP('Compare Mulitple Sires'!C11,'Breed Table'!A$5:J$22,8)","v":{"$error":"#N/A"}},{"$f":"VLOOKUP('Compare Mulitple Sires'!C11,'Breed Table'!A$5:J$22,9)","v":{"$error":"#N/A"}},{"$f":"VLOOKUP('Compare Mulitple Sires'!C11,'Breed Table'!A$5:J$22,10)","v":{"$error":"#N/A"}},null,{"$f":"VLOOKUP('Compare Mulitple Sires'!$G$52,'Breed Table'!A$5:J$22,3)","v":1.4},{"$f":"VLOOKUP('Compare Mulitple Sires'!$G$52,'Breed Table'!A$5:J$22,4)","v":-16.5},{"$f":"VLOOKUP('Compare Mulitple Sires'!$G$52,'Breed Table'!A$5:J$22,5)","v":-44.4},{"$f":"VLOOKUP('Compare Mulitple Sires'!$G$52,'Breed Table'!A$5:J$22,6)","v":-12.5},{"$f":"VLOOKUP('Compare Mulitple Sires'!$G$52,'Breed Table'!A$5:J$22,7)","v":-0.3},{"$f":"VLOOKUP('Compare Mulitple Sires'!$G$52,'Breed Table'!A$5:J$22,8)","v":0.02},{"$f":"VLOOKUP('Compare Mulitple Sires'!$G$52,'Breed Table'!A$5:J$22,9)","v":-7.2999999999999995E-2},{"$f":"VLOOKUP('Compare Mulitple Sires'!$G$52,'Breed Table'!A$5:J$22,10)","v":-41.1}]
[{"$f":"VLOOKUP('Compare Mulitple Sires'!C12,'Breed Table'!A$5:J$22,3)","v":{"$error":"#N/A"}},{"$f":"VLOOKUP('Compare Mulitple Sires'!C12,'Breed Table'!A$5:J$22,4)","v":{"$error":"#N/A"}},{"$f":"VLOOKUP('Compare Mulitple Sires'!C12,'Breed Table'!A$5:J$22,5)","v":{"$error":"#N/A"}},{"$f":"VLOOKUP('Compare Mulitple Sires'!C12,'Breed Table'!A$5:J$22,6)","v":{"$error":"#N/A"}},{"$f":"VLOOKUP('Compare Mulitple Sires'!C12,'Breed Table'!A$5:J$22,7)","v":{"$error":"#N/A"}},{"$f":"VLOOKUP('Compare Mulitple Sires'!C12,'Breed Table'!A$5:J$22,8)","v":{"$error":"#N/A"}},{"$f":"VLOOKUP('Compare Mulitple Sires'!C12,'Breed Table'!A$5:J$22,9)","v":{"$error":"#N/A"}},{"$f":"VLOOKUP('Compare Mulitple Sires'!C12,'Breed Table'!A$5:J$22,10)","v":{"$error":"#N/A"}},null,{"$f":"VLOOKUP('Compare Mulitple Sires'!$G$52,'Breed Table'!A$5:J$22,3)","v":1.4},{"$f":"VLOOKUP('Compare Mulitple Sires'!$G$52,'Breed Table'!A$5:J$22,4)","v":-16.5},{"$f":"VLOOKUP('Compare Mulitple Sires'!$G$52,'Breed Table'!A$5:J$22,5)","v":-44.4},{"$f":"VLOOKUP('Compare Mulitple Sires'!$G$52,'Breed Table'!A$5:J$22,6)","v":-12.5},{"$f":"VLOOKUP('Compare Mulitple Sires'!$G$52,'Breed Table'!A$5:J$22,7)","v":-0.3},{"$f":"VLOOKUP('Compare Mulitple Sires'!$G$52,'Breed Table'!A$5:J$22,8)","v":0.02},{"$f":"VLOOKUP('Compare Mulitple Sires'!$G$52,'Breed Table'!A$5:J$22,9)","v":-7.2999999999999995E-2},{"$f":"VLOOKUP('Compare Mulitple Sires'!$G$52,'Breed Table'!A$5:J$22,10)","v":-41.1}]
[{"$f":"VLOOKUP('Compare Mulitple Sires'!C13,'Breed Table'!A$5:J$22,3)","v":{"$error":"#N/A"}},{"$f":"VLOOKUP('Compare Mulitple Sires'!C13,'Breed Table'!A$5:J$22,4)","v":{"$error":"#N/A"}},{"$f":"VLOOKUP('Compare Mulitple Sires'!C13,'Breed Table'!A$5:J$22,5)","v":{"$error":"#N/A"}},{"$f":"VLOOKUP('Compare Mulitple Sires'!C13,'Breed Table'!A$5:J$22,6)","v":{"$error":"#N/A"}},{"$f":"VLOOKUP('Compare Mulitple Sires'!C13,'Breed Table'!A$5:J$22,7)","v":{"$error":"#N/A"}},{"$f":"VLOOKUP('Compare Mulitple Sires'!C13,'Breed Table'!A$5:J$22,8)","v":{"$error":"#N/A"}},{"$f":"VLOOKUP('Compare Mulitple Sires'!C13,'Breed Table'!A$5:J$22,9)","v":{"$error":"#N/A"}},{"$f":"VLOOKUP('Compare Mulitple Sires'!C13,'Breed Table'!A$5:J$22,10)","v":{"$error":"#N/A"}},null,{"$f":"VLOOKUP('Compare Mulitple Sires'!$G$52,'Breed Table'!A$5:J$22,3)","v":1.4},{"$f":"VLOOKUP('Compare Mulitple Sires'!$G$52,'Breed Table'!A$5:J$22,4)","v":-16.5},{"$f":"VLOOKUP('Compare Mulitple Sires'!$G$52,'Breed Table'!A$5:J$22,5)","v":-44.4},{"$f":"VLOOKUP('Compare Mulitple Sires'!$G$52,'Breed Table'!A$5:J$22,6)","v":-12.5},{"$f":"VLOOKUP('Compare Mulitple Sires'!$G$52,'Breed Table'!A$5:J$22,7)","v":-0.3},{"$f":"VLOOKUP('Compare Mulitple Sires'!$G$52,'Breed Table'!A$5:J$22,8)","v":0.02},{"$f":"VLOOKUP('Compare Mulitple Sires'!$G$52,'Breed Table'!A$5:J$22,9)","v":-7.2999999999999995E-2},{"$f":"VLOOKUP('Compare Mulitple Sires'!$G$52,'Breed Table'!A$5:J$22,10)","v":-41.1}]
[{"$f":"VLOOKUP('Compare Mulitple Sires'!C14,'Breed Table'!A$5:J$22,3)","v":{"$error":"#N/A"}},{"$f":"VLOOKUP('Compare Mulitple Sires'!C14,'Breed Table'!A$5:J$22,4)","v":{"$error":"#N/A"}},{"$f":"VLOOKUP('Compare Mulitple Sires'!C14,'Breed Table'!A$5:J$22,5)","v":{"$error":"#N/A"}},{"$f":"VLOOKUP('Compare Mulitple Sires'!C14,'Breed Table'!A$5:J$22,6)","v":{"$error":"#N/A"}},{"$f":"VLOOKUP('Compare Mulitple Sires'!C14,'Breed Table'!A$5:J$22,7)","v":{"$error":"#N/A"}},{"$f":"VLOOKUP('Compare Mulitple Sires'!C14,'Breed Table'!A$5:J$22,8)","v":{"$error":"#N/A"}},{"$f":"VLOOKUP('Compare Mulitple Sires'!C14,'Breed Table'!A$5:J$22,9)","v":{"$error":"#N/A"}},{"$f":"VLOOKUP('Compare Mulitple Sires'!C14,'Breed Table'!A$5:J$22,10)","v":{"$error":"#N/A"}},null,{"$f":"VLOOKUP('Compare Mulitple Sires'!$G$52,'Breed Table'!A$5:J$22,3)","v":1.4},{"$f":"VLOOKUP('Compare Mulitple Sires'!$G$52,'Breed Table'!A$5:J$22,4)","v":-16.5},{"$f":"VLOOKUP('Compare Mulitple Sires'!$G$52,'Breed Table'!A$5:J$22,5)","v":-44.4},{"$f":"VLOOKUP('Compare Mulitple Sires'!$G$52,'Breed Table'!A$5:J$22,6)","v":-12.5},{"$f":"VLOOKUP('Compare Mulitple Sires'!$G$52,'Breed Table'!A$5:J$22,7)","v":-0.3},{"$f":"VLOOKUP('Compare Mulitple Sires'!$G$52,'Breed Table'!A$5:J$22,8)","v":0.02},{"$f":"VLOOKUP('Compare Mulitple Sires'!$G$52,'Breed Table'!A$5:J$22,9)","v":-7.2999999999999995E-2},{"$f":"VLOOKUP('Compare Mulitple Sires'!$G$52,'Breed Table'!A$5:J$22,10)","v":-41.1}]
[{"$f":"VLOOKUP('Compare Mulitple Sires'!C15,'Breed Table'!A$5:J$22,3)","v":{"$error":"#N/A"}},{"$f":"VLOOKUP('Compare Mulitple Sires'!C15,'Breed Table'!A$5:J$22,4)","v":{"$error":"#N/A"}},{"$f":"VLOOKUP('Compare Mulitple Sires'!C15,'Breed Table'!A$5:J$22,5)","v":{"$error":"#N/A"}},{"$f":"VLOOKUP('Compare Mulitple Sires'!C15,'Breed Table'!A$5:J$22,6)","v":{"$error":"#N/A"}},{"$f":"VLOOKUP('Compare Mulitple Sires'!C15,'Breed Table'!A$5:J$22,7)","v":{"$error":"#N/A"}},{"$f":"VLOOKUP('Compare Mulitple Sires'!C15,'Breed Table'!A$5:J$22,8)","v":{"$error":"#N/A"}},{"$f":"VLOOKUP('Compare Mulitple Sires'!C15,'Breed Table'!A$5:J$22,9)","v":{"$error":"#N/A"}},{"$f":"VLOOKUP('Compare Mulitple Sires'!C15,'Breed Table'!A$5:J$22,10)","v":{"$error":"#N/A"}},null,{"$f":"VLOOKUP('Compare Mulitple Sires'!$G$52,'Breed Table'!A$5:J$22,3)","v":1.4},{"$f":"VLOOKUP('Compare Mulitple Sires'!$G$52,'Breed Table'!A$5:J$22,4)","v":-16.5},{"$f":"VLOOKUP('Compare Mulitple Sires'!$G$52,'Breed Table'!A$5:J$22,5)","v":-44.4},{"$f":"VLOOKUP('Compare Mulitple Sires'!$G$52,'Breed Table'!A$5:J$22,6)","v":-12.5},{"$f":"VLOOKUP('Compare Mulitple Sires'!$G$52,'Breed Table'!A$5:J$22,7)","v":-0.3},{"$f":"VLOOKUP('Compare Mulitple Sires'!$G$52,'Breed Table'!A$5:J$22,8)","v":0.02},{"$f":"VLOOKUP('Compare Mulitple Sires'!$G$52,'Breed Table'!A$5:J$22,9)","v":-7.2999999999999995E-2},{"$f":"VLOOKUP('Compare Mulitple Sires'!$G$52,'Breed Table'!A$5:J$22,10)","v":-41.1}]
[{"$f":"VLOOKUP('Compare Mulitple Sires'!C16,'Breed Table'!A$5:J$22,3)","v":{"$error":"#N/A"}},{"$f":"VLOOKUP('Compare Mulitple Sires'!C16,'Breed Table'!A$5:J$22,4)","v":{"$error":"#N/A"}},{"$f":"VLOOKUP('Compare Mulitple Sires'!C16,'Breed Table'!A$5:J$22,5)","v":{"$error":"#N/A"}},{"$f":"VLOOKUP('Compare Mulitple Sires'!C16,'Breed Table'!A$5:J$22,6)","v":{"$error":"#N/A"}},{"$f":"VLOOKUP('Compare Mulitple Sires'!C16,'Breed Table'!A$5:J$22,7)","v":{"$error":"#N/A"}},{"$f":"VLOOKUP('Compare Mulitple Sires'!C16,'Breed Table'!A$5:J$22,8)","v":{"$error":"#N/A"}},{"$f":"VLOOKUP('Compare Mulitple Sires'!C16,'Breed Table'!A$5:J$22,9)","v":{"$error":"#N/A"}},{"$f":"VLOOKUP('Compare Mulitple Sires'!C16,'Breed Table'!A$5:J$22,10)","v":{"$error":"#N/A"}},null,{"$f":"VLOOKUP('Compare Mulitple Sires'!$G$52,'Breed Table'!A$5:J$22,3)","v":1.4},{"$f":"VLOOKUP('Compare Mulitple Sires'!$G$52,'Breed Table'!A$5:J$22,4)","v":-16.5},{"$f":"VLOOKUP('Compare Mulitple Sires'!$G$52,'Breed Table'!A$5:J$22,5)","v":-44.4},{"$f":"VLOOKUP('Compare Mulitple Sires'!$G$52,'Breed Table'!A$5:J$22,6)","v":-12.5},{"$f":"VLOOKUP('Compare Mulitple Sires'!$G$52,'Breed Table'!A$5:J$22,7)","v":-0.3},{"$f":"VLOOKUP('Compare Mulitple Sires'!$G$52,'Breed Table'!A$5:J$22,8)","v":0.02},{"$f":"VLOOKUP('Compare Mulitple Sires'!$G$52,'Breed Table'!A$5:J$22,9)","v":-7.2999999999999995E-2},{"$f":"VLOOKUP('Compare Mulitple Sires'!$G$52,'Breed Table'!A$5:J$22,10)","v":-41.1}]
[{"$f":"VLOOKUP('Compare Mulitple Sires'!C17,'Breed Table'!A$5:J$22,3)","v":{"$error":"#N/A"}},{"$f":"VLOOKUP('Compare Mulitple Sires'!C17,'Breed Table'!A$5:J$22,4)","v":{"$error":"#N/A"}},{"$f":"VLOOKUP('Compare Mulitple Sires'!C17,'Breed Table'!A$5:J$22,5)","v":{"$error":"#N/A"}},{"$f":"VLOOKUP('Compare Mulitple Sires'!C17,'Breed Table'!A$5:J$22,6)","v":{"$error":"#N/A"}},{"$f":"VLOOKUP('Compare Mulitple Sires'!C17,'Breed Table'!A$5:J$22,7)","v":{"$error":"#N/A"}},{"$f":"VLOOKUP('Compare Mulitple Sires'!C17,'Breed Table'!A$5:J$22,8)","v":{"$error":"#N/A"}},{"$f":"VLOOKUP('Compare Mulitple Sires'!C17,'Breed Table'!A$5:J$22,9)","v":{"$error":"#N/A"}},{"$f":"VLOOKUP('Compare Mulitple Sires'!C17,'Breed Table'!A$5:J$22,10)","v":{"$error":"#N/A"}},null,{"$f":"VLOOKUP('Compare Mulitple Sires'!$G$52,'Breed Table'!A$5:J$22,3)","v":1.4},{"$f":"VLOOKUP('Compare Mulitple Sires'!$G$52,'Breed Table'!A$5:J$22,4)","v":-16.5},{"$f":"VLOOKUP('Compare Mulitple Sires'!$G$52,'Breed Table'!A$5:J$22,5)","v":-44.4},{"$f":"VLOOKUP('Compare Mulitple Sires'!$G$52,'Breed Table'!A$5:J$22,6)","v":-12.5},{"$f":"VLOOKUP('Compare Mulitple Sires'!$G$52,'Breed Table'!A$5:J$22,7)","v":-0.3},{"$f":"VLOOKUP('Compare Mulitple Sires'!$G$52,'Breed Table'!A$5:J$22,8)","v":0.02},{"$f":"VLOOKUP('Compare Mulitple Sires'!$G$52,'Breed Table'!A$5:J$22,9)","v":-7.2999999999999995E-2},{"$f":"VLOOKUP('Compare Mulitple Sires'!$G$52,'Breed Table'!A$5:J$22,10)","v":-41.1}]
[{"$f":"VLOOKUP('Compare Mulitple Sires'!C18,'Breed Table'!A$5:J$22,3)","v":{"$error":"#N/A"}},{"$f":"VLOOKUP('Compare Mulitple Sires'!C18,'Breed Table'!A$5:J$22,4)","v":{"$error":"#N/A"}},{"$f":"VLOOKUP('Compare Mulitple Sires'!C18,'Breed Table'!A$5:J$22,5)","v":{"$error":"#N/A"}},{"$f":"VLOOKUP('Compare Mulitple Sires'!C18,'Breed Table'!A$5:J$22,6)","v":{"$error":"#N/A"}},{"$f":"VLOOKUP('Compare Mulitple Sires'!C18,'Breed Table'!A$5:J$22,7)","v":{"$error":"#N/A"}},{"$f":"VLOOKUP('Compare Mulitple Sires'!C18,'Breed Table'!A$5:J$22,8)","v":{"$error":"#N/A"}},{"$f":"VLOOKUP('Compare Mulitple Sires'!C18,'Breed Table'!A$5:J$22,9)","v":{"$error":"#N/A"}},{"$f":"VLOOKUP('Compare Mulitple Sires'!C18,'Breed Table'!A$5:J$22,10)","v":{"$error":"#N/A"}},null,{"$f":"VLOOKUP('Compare Mulitple Sires'!$G$52,'Breed Table'!A$5:J$22,3)","v":1.4},{"$f":"VLOOKUP('Compare Mulitple Sires'!$G$52,'Breed Table'!A$5:J$22,4)","v":-16.5},{"$f":"VLOOKUP('Compare Mulitple Sires'!$G$52,'Breed Table'!A$5:J$22,5)","v":-44.4},{"$f":"VLOOKUP('Compare Mulitple Sires'!$G$52,'Breed Table'!A$5:J$22,6)","v":-12.5},{"$f":"VLOOKUP('Compare Mulitple Sires'!$G$52,'Breed Table'!A$5:J$22,7)","v":-0.3},{"$f":"VLOOKUP('Compare Mulitple Sires'!$G$52,'Breed Table'!A$5:J$22,8)","v":0.02},{"$f":"VLOOKUP('Compare Mulitple Sires'!$G$52,'Breed Table'!A$5:J$22,9)","v":-7.2999999999999995E-2},{"$f":"VLOOKUP('Compare Mulitple Sires'!$G$52,'Breed Table'!A$5:J$22,10)","v":-41.1}]
[{"$f":"VLOOKUP('Compare Mulitple Sires'!C19,'Breed Table'!A$5:J$22,3)","v":{"$error":"#N/A"}},{"$f":"VLOOKUP('Compare Mulitple Sires'!C19,'Breed Table'!A$5:J$22,4)","v":{"$error":"#N/A"}},{"$f":"VLOOKUP('Compare Mulitple Sires'!C19,'Breed Table'!A$5:J$22,5)","v":{"$error":"#N/A"}},{"$f":"VLOOKUP('Compare Mulitple Sires'!C19,'Breed Table'!A$5:J$22,6)","v":{"$error":"#N/A"}},{"$f":"VLOOKUP('Compare Mulitple Sires'!C19,'Breed Table'!A$5:J$22,7)","v":{"$error":"#N/A"}},{"$f":"VLOOKUP('Compare Mulitple Sires'!C19,'Breed Table'!A$5:J$22,8)","v":{"$error":"#N/A"}},{"$f":"VLOOKUP('Compare Mulitple Sires'!C19,'Breed Table'!A$5:J$22,9)","v":{"$error":"#N/A"}},{"$f":"VLOOKUP('Compare Mulitple Sires'!C19,'Breed Table'!A$5:J$22,10)","v":{"$error":"#N/A"}},null,{"$f":"VLOOKUP('Compare Mulitple Sires'!$G$52,'Breed Table'!A$5:J$22,3)","v":1.4},{"$f":"VLOOKUP('Compare Mulitple Sires'!$G$52,'Breed Table'!A$5:J$22,4)","v":-16.5},{"$f":"VLOOKUP('Compare Mulitple Sires'!$G$52,'Breed Table'!A$5:J$22,5)","v":-44.4},{"$f":"VLOOKUP('Compare Mulitple Sires'!$G$52,'Breed Table'!A$5:J$22,6)","v":-12.5},{"$f":"VLOOKUP('Compare Mulitple Sires'!$G$52,'Breed Table'!A$5:J$22,7)","v":-0.3},{"$f":"VLOOKUP('Compare Mulitple Sires'!$G$52,'Breed Table'!A$5:J$22,8)","v":0.02},{"$f":"VLOOKUP('Compare Mulitple Sires'!$G$52,'Breed Table'!A$5:J$22,9)","v":-7.2999999999999995E-2},{"$f":"VLOOKUP('Compare Mulitple Sires'!$G$52,'Breed Table'!A$5:J$22,10)","v":-41.1}]
[{"$f":"VLOOKUP('Compare Mulitple Sires'!C20,'Breed Table'!A$5:J$22,3)","v":{"$error":"#N/A"}},{"$f":"VLOOKUP('Compare Mulitple Sires'!C20,'Breed Table'!A$5:J$22,4)","v":{"$error":"#N/A"}},{"$f":"VLOOKUP('Compare Mulitple Sires'!C20,'Breed Table'!A$5:J$22,5)","v":{"$error":"#N/A"}},{"$f":"VLOOKUP('Compare Mulitple Sires'!C20,'Breed Table'!A$5:J$22,6)","v":{"$error":"#N/A"}},{"$f":"VLOOKUP('Compare Mulitple Sires'!C20,'Breed Table'!A$5:J$22,7)","v":{"$error":"#N/A"}},{"$f":"VLOOKUP('Compare Mulitple Sires'!C20,'Breed Table'!A$5:J$22,8)","v":{"$error":"#N/A"}},{"$f":"VLOOKUP('Compare Mulitple Sires'!C20,'Breed Table'!A$5:J$22,9)","v":{"$error":"#N/A"}},{"$f":"VLOOKUP('Compare Mulitple Sires'!C20,'Breed Table'!A$5:J$22,10)","v":{"$error":"#N/A"}},null,{"$f":"VLOOKUP('Compare Mulitple Sires'!$G$52,'Breed Table'!A$5:J$22,3)","v":1.4},{"$f":"VLOOKUP('Compare Mulitple Sires'!$G$52,'Breed Table'!A$5:J$22,4)","v":-16.5},{"$f":"VLOOKUP('Compare Mulitple Sires'!$G$52,'Breed Table'!A$5:J$22,5)","v":-44.4},{"$f":"VLOOKUP('Compare Mulitple Sires'!$G$52,'Breed Table'!A$5:J$22,6)","v":-12.5},{"$f":"VLOOKUP('Compare Mulitple Sires'!$G$52,'Breed Table'!A$5:J$22,7)","v":-0.3},{"$f":"VLOOKUP('Compare Mulitple Sires'!$G$52,'Breed Table'!A$5:J$22,8)","v":0.02},{"$f":"VLOOKUP('Compare Mulitple Sires'!$G$52,'Breed Table'!A$5:J$22,9)","v":-7.2999999999999995E-2},{"$f":"VLOOKUP('Compare Mulitple Sires'!$G$52,'Breed Table'!A$5:J$22,10)","v":-41.1}]
[{"$f":"VLOOKUP('Compare Mulitple Sires'!C21,'Breed Table'!A$5:J$22,3)","v":{"$error":"#N/A"}},{"$f":"VLOOKUP('Compare Mulitple Sires'!C21,'Breed Table'!A$5:J$22,4)","v":{"$error":"#N/A"}},{"$f":"VLOOKUP('Compare Mulitple Sires'!C21,'Breed Table'!A$5:J$22,5)","v":{"$error":"#N/A"}},{"$f":"VLOOKUP('Compare Mulitple Sires'!C21,'Breed Table'!A$5:J$22,6)","v":{"$error":"#N/A"}},{"$f":"VLOOKUP('Compare Mulitple Sires'!C21,'Breed Table'!A$5:J$22,7)","v":{"$error":"#N/A"}},{"$f":"VLOOKUP('Compare Mulitple Sires'!C21,'Breed Table'!A$5:J$22,8)","v":{"$error":"#N/A"}},{"$f":"VLOOKUP('Compare Mulitple Sires'!C21,'Breed Table'!A$5:J$22,9)","v":{"$error":"#N/A"}},{"$f":"VLOOKUP('Compare Mulitple Sires'!C21,'Breed Table'!A$5:J$22,10)","v":{"$error":"#N/A"}},null,{"$f":"VLOOKUP('Compare Mulitple Sires'!$G$52,'Breed Table'!A$5:J$22,3)","v":1.4},{"$f":"VLOOKUP('Compare Mulitple Sires'!$G$52,'Breed Table'!A$5:J$22,4)","v":-16.5},{"$f":"VLOOKUP('Compare Mulitple Sires'!$G$52,'Breed Table'!A$5:J$22,5)","v":-44.4},{"$f":"VLOOKUP('Compare Mulitple Sires'!$G$52,'Breed Table'!A$5:J$22,6)","v":-12.5},{"$f":"VLOOKUP('Compare Mulitple Sires'!$G$52,'Breed Table'!A$5:J$22,7)","v":-0.3},{"$f":"VLOOKUP('Compare Mulitple Sires'!$G$52,'Breed Table'!A$5:J$22,8)","v":0.02},{"$f":"VLOOKUP('Compare Mulitple Sires'!$G$52,'Breed Table'!A$5:J$22,9)","v":-7.2999999999999995E-2},{"$f":"VLOOKUP('Compare Mulitple Sires'!$G$52,'Breed Table'!A$5:J$22,10)","v":-41.1}]
[{"$f":"VLOOKUP('Compare Mulitple Sires'!C22,'Breed Table'!A$5:J$22,3)","v":{"$error":"#N/A"}},{"$f":"VLOOKUP('Compare Mulitple Sires'!C22,'Breed Table'!A$5:J$22,4)","v":{"$error":"#N/A"}},{"$f":"VLOOKUP('Compare Mulitple Sires'!C22,'Breed Table'!A$5:J$22,5)","v":{"$error":"#N/A"}},{"$f":"VLOOKUP('Compare Mulitple Sires'!C22,'Breed Table'!A$5:J$22,6)","v":{"$error":"#N/A"}},{"$f":"VLOOKUP('Compare Mulitple Sires'!C22,'Breed Table'!A$5:J$22,7)","v":{"$error":"#N/A"}},{"$f":"VLOOKUP('Compare Mulitple Sires'!C22,'Breed Table'!A$5:J$22,8)","v":{"$error":"#N/A"}},{"$f":"VLOOKUP('Compare Mulitple Sires'!C22,'Breed Table'!A$5:J$22,9)","v":{"$error":"#N/A"}},{"$f":"VLOOKUP('Compare Mulitple Sires'!C22,'Breed Table'!A$5:J$22,10)","v":{"$error":"#N/A"}},null,{"$f":"VLOOKUP('Compare Mulitple Sires'!$G$52,'Breed Table'!A$5:J$22,3)","v":1.4},{"$f":"VLOOKUP('Compare Mulitple Sires'!$G$52,'Breed Table'!A$5:J$22,4)","v":-16.5},{"$f":"VLOOKUP('Compare Mulitple Sires'!$G$52,'Breed Table'!A$5:J$22,5)","v":-44.4},{"$f":"VLOOKUP('Compare Mulitple Sires'!$G$52,'Breed Table'!A$5:J$22,6)","v":-12.5},{"$f":"VLOOKUP('Compare Mulitple Sires'!$G$52,'Breed Table'!A$5:J$22,7)","v":-0.3},{"$f":"VLOOKUP('Compare Mulitple Sires'!$G$52,'Breed Table'!A$5:J$22,8)","v":0.02},{"$f":"VLOOKUP('Compare Mulitple Sires'!$G$52,'Breed Table'!A$5:J$22,9)","v":-7.2999999999999995E-2},{"$f":"VLOOKUP('Compare Mulitple Sires'!$G$52,'Breed Table'!A$5:J$22,10)","v":-41.1}]
[{"$f":"VLOOKUP('Compare Mulitple Sires'!C23,'Breed Table'!A$5:J$22,3)","v":{"$error":"#N/A"}},{"$f":"VLOOKUP('Compare Mulitple Sires'!C23,'Breed Table'!A$5:J$22,4)","v":{"$error":"#N/A"}},{"$f":"VLOOKUP('Compare Mulitple Sires'!C23,'Breed Table'!A$5:J$22,5)","v":{"$error":"#N/A"}},{"$f":"VLOOKUP('Compare Mulitple Sires'!C23,'Breed Table'!A$5:J$22,6)","v":{"$error":"#N/A"}},{"$f":"VLOOKUP('Compare Mulitple Sires'!C23,'Breed Table'!A$5:J$22,7)","v":{"$error":"#N/A"}},{"$f":"VLOOKUP('Compare Mulitple Sires'!C23,'Breed Table'!A$5:J$22,8)","v":{"$error":"#N/A"}},{"$f":"VLOOKUP('Compare Mulitple Sires'!C23,'Breed Table'!A$5:J$22,9)","v":{"$error":"#N/A"}},{"$f":"VLOOKUP('Compare Mulitple Sires'!C23,'Breed Table'!A$5:J$22,10)","v":{"$error":"#N/A"}},null,{"$f":"VLOOKUP('Compare Mulitple Sires'!$G$52,'Breed Table'!A$5:J$22,3)","v":1.4},{"$f":"VLOOKUP('Compare Mulitple Sires'!$G$52,'Breed Table'!A$5:J$22,4)","v":-16.5},{"$f":"VLOOKUP('Compare Mulitple Sires'!$G$52,'Breed Table'!A$5:J$22,5)","v":-44.4},{"$f":"VLOOKUP('Compare Mulitple Sires'!$G$52,'Breed Table'!A$5:J$22,6)","v":-12.5},{"$f":"VLOOKUP('Compare Mulitple Sires'!$G$52,'Breed Table'!A$5:J$22,7)","v":-0.3},{"$f":"VLOOKUP('Compare Mulitple Sires'!$G$52,'Breed Table'!A$5:J$22,8)","v":0.02},{"$f":"VLOOKUP('Compare Mulitple Sires'!$G$52,'Breed Table'!A$5:J$22,9)","v":-7.2999999999999995E-2},{"$f":"VLOOKUP('Compare Mulitple Sires'!$G$52,'Breed Table'!A$5:J$22,10)","v":-41.1}]
[{"$f":"VLOOKUP('Compare Mulitple Sires'!C24,'Breed Table'!A$5:J$22,3)","v":{"$error":"#N/A"}},{"$f":"VLOOKUP('Compare Mulitple Sires'!C24,'Breed Table'!A$5:J$22,4)","v":{"$error":"#N/A"}},{"$f":"VLOOKUP('Compare Mulitple Sires'!C24,'Breed Table'!A$5:J$22,5)","v":{"$error":"#N/A"}},{"$f":"VLOOKUP('Compare Mulitple Sires'!C24,'Breed Table'!A$5:J$22,6)","v":{"$error":"#N/A"}},{"$f":"VLOOKUP('Compare Mulitple Sires'!C24,'Breed Table'!A$5:J$22,7)","v":{"$error":"#N/A"}},{"$f":"VLOOKUP('Compare Mulitple Sires'!C24,'Breed Table'!A$5:J$22,8)","v":{"$error":"#N/A"}},{"$f":"VLOOKUP('Compare Mulitple Sires'!C24,'Breed Table'!A$5:J$22,9)","v":{"$error":"#N/A"}},{"$f":"VLOOKUP('Compare Mulitple Sires'!C24,'Breed Table'!A$5:J$22,10)","v":{"$error":"#N/A"}},null,{"$f":"VLOOKUP('Compare Mulitple Sires'!$G$52,'Breed Table'!A$5:J$22,3)","v":1.4},{"$f":"VLOOKUP('Compare Mulitple Sires'!$G$52,'Breed Table'!A$5:J$22,4)","v":-16.5},{"$f":"VLOOKUP('Compare Mulitple Sires'!$G$52,'Breed Table'!A$5:J$22,5)","v":-44.4},{"$f":"VLOOKUP('Compare Mulitple Sires'!$G$52,'Breed Table'!A$5:J$22,6)","v":-12.5},{"$f":"VLOOKUP('Compare Mulitple Sires'!$G$52,'Breed Table'!A$5:J$22,7)","v":-0.3},{"$f":"VLOOKUP('Compare Mulitple Sires'!$G$52,'Breed Table'!A$5:J$22,8)","v":0.02},{"$f":"VLOOKUP('Compare Mulitple Sires'!$G$52,'Breed Table'!A$5:J$22,9)","v":-7.2999999999999995E-2},{"$f":"VLOOKUP('Compare Mulitple Sires'!$G$52,'Breed Table'!A$5:J$22,10)","v":-41.1}]